BDBM50119880 CHEMBL3616515
SMILES: On1c(=O)[nH]c2ncn(CCc3ccccn3)c2c1=O
InChI Key: InChIKey=GMMRACBVDJXXRU-UHFFFAOYSA-N
Data: 1 IC50
Activity Spreadsheet -- Enzyme Inhibition Constant Data from BindingDB
Found 1 hit for monomerid = 50119880
Trg + Lig
Ki
nM
ΔG°
kcal/mole
IC50
nM
Kd
nM
EC50/IC50
nM
koff
s-1
kon
M-1s-1
pHTemp
°C
CCR4-NOT transcription complex subunit 7
(Homo sapiens (Human))
BDBM50119880
(CHEMBL3616515)
Show SMILES On1c(=O)[nH]c2ncn(CCc3ccccn3)c2c1=O
Show InChI InChI=1S/C12H11N5O3/c18-11-9-10(15-12(19)17(11)20)14-7-16(9)6-4-8-3-1-2-5-13-8/h1-3,5,7,20H,4,6H2,(H,15,19)
n/an/a 4.00E+3n/an/an/an/an/an/a
University of Nottingham
Curated by ChEMBL
Assay Description
Inhibition of human poly(A)-selective ribonuclease Caf1 by fluorescence-based assay
Bioorg Med Chem Lett 25: 4219-24 (2015)
BindingDB Entry DOI: 10.7270/Q2BV7JFF