BDBM5012 (3R,4R,5S)-3-[(2S)-butan-2-yloxy]-5-carbamimidamido-4-acetamidocyclohex-1-ene-1-carboxylic acid::(3R,4R,5S)-4-Acetamido-5-guanidinyl-3-(1(S)-methylpropoxy)-1-cyclohexene-1-carboxylic acid::Carbocyclic Analogue 62
SMILES: CC[C@H](C)O[C@@H]1C=C(C[C@H](N=C(N)N)[C@H]1NC(C)=O)C(O)=O
InChI Key: InChIKey=BKSBSWKRQZCHQR-CWPPHPDTSA-N
Data: 1 IC50
Activity Spreadsheet -- Enzyme Inhibition Constant Data from BindingDB
Found 1 hit for monomerid = 5012
Trg + Lig
Ki
nM
ΔG°
kcal/mole
IC50
nM
Kd
nM
EC50/IC50
nM
koff
s-1
kon
M-1s-1
pHTemp
°C
Neuraminidase A
(Influenza A virus (A/Puerto Rico/8/34/Mount Sinai(...)
BDBM5012
((3R,4R,5S)-3-[(2S)-butan-2-yloxy]-5-carbamimidamid...)
Show SMILES CC[C@H](C)O[C@@H]1C=C(C[C@H](N=C(N)N)[C@H]1NC(C)=O)C(O)=O |r,c:6|
Show InChI InChI=1S/C14H24N4O4/c1-4-7(2)22-11-6-9(13(20)21)5-10(18-14(15)16)12(11)17-8(3)19/h6-7,10-12H,4-5H2,1-3H3,(H,17,19)(H,20,21)(H4,15,16,18)/t7-,10-,11+,12+/m0/s1
n/an/a 0.5n/an/an/an/an/an/a
Gilead Sciences Inc.
Assay Description
A standard fluorimetric assay was used to measure influenza virus neuraminidase activity. The substrate 2 -(4-methylumbelliferyl)-alpha-D-acetylneura...
J Med Chem 41: 2451-60 (1998)
Article DOI: 10.1021/jm980162u
BindingDB Entry DOI: 10.7270/Q2MP51GP