BDBM50120071 7-(3-Chloro-4-methoxy-benzyl)-8-cyclopentylamino-1,3-diethyl-3,7-dihydro-purine-2,6-dione::CHEMBL110595
SMILES: CCn1c2nc(NC3CCCC3)n(Cc3ccc(OC)c(Cl)c3)c2c(=O)n(CC)c1=O
InChI Key: InChIKey=IJDDORRYFPXKTK-UHFFFAOYSA-N
Data: 1 IC50
Activity Spreadsheet -- Enzyme Inhibition Constant Data from BindingDB
Found 1 hit for monomerid = 50120071
Trg + Lig
Ki
nM
ΔG°
kcal/mole
IC50
nM
Kd
nM
EC50/IC50
nM
koff
s-1
kon
M-1s-1
pHTemp
°C
cGMP-specific 3',5'-cyclic phosphodiesterase
(Homo sapiens (Human))
BDBM50120071
(7-(3-Chloro-4-methoxy-benzyl)-8-cyclopentylamino-1...)
Show SMILES CCn1c2nc(NC3CCCC3)n(Cc3ccc(OC)c(Cl)c3)c2c(=O)n(CC)c1=O
Show InChI InChI=1S/C22H28ClN5O3/c1-4-26-19-18(20(29)27(5-2)22(26)30)28(21(25-19)24-15-8-6-7-9-15)13-14-10-11-17(31-3)16(23)12-14/h10-12,15H,4-9,13H2,1-3H3,(H,24,25)
Reactome pathway
n/an/a 1.10n/an/an/an/an/an/a
Schering-Plough Research Institute
Curated by ChEMBL
Assay Description
Concentration required to inhibit phosphodiesterase type 5 (PDE5) isolated from corpus cavernosum by 50% was determined
Bioorg Med Chem Lett 12: 3149-52 (2002)
BindingDB Entry DOI: 10.7270/Q2S46R83