BDBM50120125 (2-Chloro-6-methyl-phenyl)-[8-methoxy-7-(2-morpholin-4-yl-ethoxy)-imidazo[1,5-a]quinoxalin-4-yl]-amine::CHEMBL106457::N-(2-chloro-6-methylphenyl)-8-methoxy-7-(2-morpholinoethoxy)imidazo[1,5-a]quinoxalin-4-amine
SMILES: COc1cc2c(cc1OCCN1CCOCC1)nc(Nc1c(C)cccc1Cl)c1cncn21
InChI Key: InChIKey=STQVCPJKSVZHHV-UHFFFAOYSA-N
Data: 2 IC50
Activity Spreadsheet -- Enzyme Inhibition Constant Data from BindingDB
Found 2 hits for monomerid = 50120125
Trg + Lig
Ki
nM
ΔG°
kcal/mole
IC50
nM
Kd
nM
EC50/IC50
nM
koff
s-1
kon
M-1s-1
pHTemp
°C
Tyrosine-protein kinase Lck
(Homo sapiens (Human))
BDBM50120125
((2-Chloro-6-methyl-phenyl)-[8-methoxy-7-(2-morphol...)
Show SMILES COc1cc2c(cc1OCCN1CCOCC1)nc(Nc1c(C)cccc1Cl)c1cncn21
Show InChI InChI=1S/C24H26ClN5O3/c1-16-4-3-5-17(25)23(16)28-24-20-14-26-15-30(20)19-13-21(31-2)22(12-18(19)27-24)33-11-8-29-6-9-32-10-7-29/h3-5,12-15H,6-11H2,1-2H3,(H,27,28)
n/an/a 2.40n/an/an/an/an/an/a
University of Zurich
Curated by ChEMBL
Assay Description
Inhibition of Lck
J Med Chem 51: 1179-88 (2008)
Article DOI: 10.1021/jm070654j
BindingDB Entry DOI: 10.7270/Q29Z95RD
Tyrosine-protein kinase Lck
(Homo sapiens (Human))
BDBM50120125
((2-Chloro-6-methyl-phenyl)-[8-methoxy-7-(2-morphol...)
Show SMILES COc1cc2c(cc1OCCN1CCOCC1)nc(Nc1c(C)cccc1Cl)c1cncn21
Show InChI InChI=1S/C24H26ClN5O3/c1-16-4-3-5-17(25)23(16)28-24-20-14-26-15-30(20)19-13-21(31-2)22(12-18(19)27-24)33-11-8-29-6-9-32-10-7-29/h3-5,12-15H,6-11H2,1-2H3,(H,27,28)
n/an/a 2.40n/an/an/an/an/an/a
Bristol Myers Squibb Pharmaceutical Research Institute
Curated by ChEMBL
Assay Description
50% inhibition of the phosphorylation of an exogenous substrate by human Lck enzyme.
Bioorg Med Chem Lett 12: 3153-6 (2002)
BindingDB Entry DOI: 10.7270/Q2NC60JR