null
SMILES: CCCCC(c1ccc(cc1)C(=O)NCCC(O)=O)n1nc(-c2cc(ccc2OC)C(F)(F)F)c2ccc(cc12)-c1ccc(cc1)C(F)(F)F
InChI Key: InChIKey=XFRFVGHDRBIEOP-UHFFFAOYSA-N
Activity Spreadsheet -- Enzyme Inhibition Constant Data from BindingDB
Found 2 hits for monomerid = 50120366
Trg + Lig
Ki
nM
ΔG°
kcal/mole
IC50
nM
Kd
nM
EC50/IC50
nM
koff
s-1
kon
M-1s-1
pHTemp
°C
Glucagon receptor
(Homo sapiens (Human))
BDBM50120366
(CHEMBL3616694)
Show SMILES CCCCC(c1ccc(cc1)C(=O)NCCC(O)=O)n1nc(-c2cc(ccc2OC)C(F)(F)F)c2ccc(cc12)-c1ccc(cc1)C(F)(F)F
Show InChI InChI=1S/C37H33F6N3O4/c1-3-4-5-30(23-6-8-24(9-7-23)35(49)44-19-18-33(47)48)46-31-20-25(22-10-13-26(14-11-22)36(38,39)40)12-16-28(31)34(45-46)29-21-27(37(41,42)43)15-17-32(29)50-2/h6-17,20-21,30H,3-5,18-19H2,1-2H3,(H,44,49)(H,47,48)
n/an/a 1.60n/an/an/an/an/an/a
Merck Research Laboratories
Curated by ChEMBL
Assay Description
Displacement of [125I]glucagon from human glucagon receptor expressed in CHO cell membranes
Bioorg Med Chem Lett 25: 4143-7 (2015)
BindingDB Entry DOI: 10.7270/Q23F4RGX
Glucagon receptor
(Homo sapiens (Human))
BDBM50120366
(CHEMBL3616694)
Show SMILES CCCCC(c1ccc(cc1)C(=O)NCCC(O)=O)n1nc(-c2cc(ccc2OC)C(F)(F)F)c2ccc(cc12)-c1ccc(cc1)C(F)(F)F
Show InChI InChI=1S/C37H33F6N3O4/c1-3-4-5-30(23-6-8-24(9-7-23)35(49)44-19-18-33(47)48)46-31-20-25(22-10-13-26(14-11-22)36(38,39)40)12-16-28(31)34(45-46)29-21-27(37(41,42)43)15-17-32(29)50-2/h6-17,20-21,30H,3-5,18-19H2,1-2H3,(H,44,49)(H,47,48)
n/an/a 14n/an/an/an/an/an/a
Merck Research Laboratories
Curated by ChEMBL
Assay Description
Antagonist activity against human glucagon receptor expressed in CHO cells assessed as reduction in glucagon-induced cAMP production
Bioorg Med Chem Lett 25: 4143-7 (2015)
BindingDB Entry DOI: 10.7270/Q23F4RGX