BDBM50120491 CHEMBL3617995
SMILES: [H][C@]1(O[C@H](CO)[C@@H](O)[C@H](O)[C@H]1O)[C@]1([H])c2cccc(O)c2C(=O)c2c(O)cc(C)cc12
InChI Key: InChIKey=RZCVGOHQLRNJKQ-WEZNYRQKSA-N
Data: 1 KI  1 IC50
Activity Spreadsheet -- Enzyme Inhibition Constant Data from BindingDB
Found 2 hits for monomerid = 50120491
Trg + Lig
Ki
nM
ΔG°
kcal/mole
IC50
nM
Kd
nM
EC50/IC50
nM
koff
s-1
kon
M-1s-1
pHTemp
°C
EBifunctional epoxide hydrolase 2
(Homo sapiens (Human))
BDBM50120491
(CHEMBL3617995)
Show SMILES [H][C@]1(O[C@H](CO)[C@@H](O)[C@H](O)[C@H]1O)[C@]1([H])c2cccc(O)c2C(=O)c2c(O)cc(C)cc12 |r|
Show InChI InChI=1S/C21H22O8/c1-8-5-10-14(21-20(28)19(27)17(25)13(7-22)29-21)9-3-2-4-11(23)15(9)18(26)16(10)12(24)6-8/h2-6,13-14,17,19-25,27-28H,7H2,1H3/t13-,14-,17-,19+,20-,21+/m1/s1
200n/an/an/an/an/an/an/an/a
Chungnam National University
Curated by ChEMBL
Assay Description
Mixed-type inhibition of sEH (unknown origin) using PHOME as substrate assessed as formation of 6-methoxy-2-naphthaldehyde measured during 30 mins by...
Bioorg Med Chem 23: 6659-65 (2015)
BindingDB Entry DOI: 10.7270/Q22F7Q8N
EBifunctional epoxide hydrolase 2
(Homo sapiens (Human))
BDBM50120491
(CHEMBL3617995)
Show SMILES [H][C@]1(O[C@H](CO)[C@@H](O)[C@H](O)[C@H]1O)[C@]1([H])c2cccc(O)c2C(=O)c2c(O)cc(C)cc12 |r|
Show InChI InChI=1S/C21H22O8/c1-8-5-10-14(21-20(28)19(27)17(25)13(7-22)29-21)9-3-2-4-11(23)15(9)18(26)16(10)12(24)6-8/h2-6,13-14,17,19-25,27-28H,7H2,1H3/t13-,14-,17-,19+,20-,21+/m1/s1
n/an/a 1.56E+4n/an/an/an/an/an/a
Chungnam National University
Curated by ChEMBL
Assay Description
Inhibition of sEH (unknown origin) using PHOME as substrate assessed as formation of 6-methoxy-2-naphthaldehyde measured during 1 hr by fluorescence ...
Bioorg Med Chem 23: 6659-65 (2015)
BindingDB Entry DOI: 10.7270/Q22F7Q8N