BDBM50120578 CHEMBL3618195
SMILES: Fc1cc(NC(=O)N2CCC(CC2)c2ccc(Br)cc2)cc(c1)C(F)(F)F
InChI Key: InChIKey=DAFJKCOYEBEQOE-UHFFFAOYSA-N
Data: 1 IC50
Activity Spreadsheet -- Enzyme Inhibition Constant Data from BindingDB
Found 1 hit for monomerid = 50120578
Trg + Lig
Ki
nM
ΔG°
kcal/mole
IC50
nM
Kd
nM
EC50/IC50
nM
koff
s-1
kon
M-1s-1
pHTemp
°C
Sphingosine 1-phosphate receptor 2
(Homo sapiens (Human))
BDBM50120578
(CHEMBL3618195)
Show SMILES Fc1cc(NC(=O)N2CCC(CC2)c2ccc(Br)cc2)cc(c1)C(F)(F)F
Show InChI InChI=1S/C19H17BrF4N2O/c20-15-3-1-12(2-4-15)13-5-7-26(8-6-13)18(27)25-17-10-14(19(22,23)24)9-16(21)11-17/h1-4,9-11,13H,5-8H2,(H,25,27)
NCI pathway
Reactome pathway
n/an/a>2.50E+4n/an/an/an/an/an/a
Ono Pharmaceutical Co.
Curated by ChEMBL
Assay Description
Antagonist activity at human S1P2 expressed in CHO cells assessed as Ca2+ level by FURA-2AM dye based fluorescence assay
Bioorg Med Chem Lett 25: 4387-92 (2015)
BindingDB Entry DOI: 10.7270/Q2SX6G1K