BDBM50120591 CHEMBL3618297
SMILES: CCC(=O)C1=C(C)N=C2Sc3ccccc3N2C1c1cccc(c1)[N+]([O-])=O
InChI Key: InChIKey=YKTJCCFZQMXYFE-UHFFFAOYSA-N
Data: 2 IC50
Activity Spreadsheet -- Enzyme Inhibition Constant Data from BindingDB
Found 2 hits for monomerid = 50120591
Trg + Lig
Ki
nM
ΔG°
kcal/mole
IC50
nM
Kd
nM
EC50/IC50
nM
koff
s-1
kon
M-1s-1
pHTemp
°C
Myosin light chain kinase, smooth muscle
(Homo sapiens (Human))
BDBM50120591
(CHEMBL3618297)
Show SMILES CCC(=O)C1=C(C)N=C2Sc3ccccc3N2C1c1cccc(c1)[N+]([O-])=O |c:4,t:7|
Show InChI InChI=1S/C20H17N3O3S/c1-3-16(24)18-12(2)21-20-22(15-9-4-5-10-17(15)27-20)19(18)13-7-6-8-14(11-13)23(25)26/h4-11,19H,3H2,1-2H3
n/an/a 2.10E+10n/an/an/an/an/an/a
Rashtrasant Tukadoji Maharaj Nagpur University
Curated by ChEMBL
Assay Description
Inhibition of MLCK (unknown origin) incubated for 15 mins using [gamma-32P]-ATP by scintillation counting method
Bioorg Med Chem 23: 6689-713 (2015)
BindingDB Entry DOI: 10.7270/Q2P55Q95
Myosin light chain kinase, smooth muscle
(Homo sapiens (Human))
BDBM50120591
(CHEMBL3618297)
Show SMILES CCC(=O)C1=C(C)N=C2Sc3ccccc3N2C1c1cccc(c1)[N+]([O-])=O |c:4,t:7|
Show InChI InChI=1S/C20H17N3O3S/c1-3-16(24)18-12(2)21-20-22(15-9-4-5-10-17(15)27-20)19(18)13-7-6-8-14(11-13)23(25)26/h4-11,19H,3H2,1-2H3
n/an/a 2.10E+3n/an/an/an/an/an/a
Rashtrasant Tukadoji Maharaj Nagpur University
Curated by ChEMBL
Assay Description
Inhibition of MLCK (unknown origin) incubated for 15 mins using [gamma-32P]-ATP by scintillation counting method
Bioorg Med Chem 23: 6689-713 (2015)
BindingDB Entry DOI: 10.7270/Q2P55Q95