BDBM50120602 CHEMBL564992
SMILES: CCOC(=O)C1=C(C)NC(OC)N(CC(=O)c2ccccc2)C1c1ccc(O)cc1
InChI Key: InChIKey=WJJPDKPQZZEXIW-UHFFFAOYSA-N
Data: 2 IC50
Activity Spreadsheet -- Enzyme Inhibition Constant Data from BindingDB
Found 2 hits for monomerid = 50120602
Trg + Lig
Ki
nM
ΔG°
kcal/mole
IC50
nM
Kd
nM
EC50/IC50
nM
koff
s-1
kon
M-1s-1
pHTemp
°C
Myosin light chain kinase, smooth muscle
(Homo sapiens (Human))
BDBM50120602
(CHEMBL564992)
Show SMILES CCOC(=O)C1=C(C)NC(OC)N(CC(=O)c2ccccc2)C1c1ccc(O)cc1 |c:5|
Show InChI InChI=1S/C23H26N2O5/c1-4-30-22(28)20-15(2)24-23(29-3)25(14-19(27)16-8-6-5-7-9-16)21(20)17-10-12-18(26)13-11-17/h5-13,21,23-24,26H,4,14H2,1-3H3
n/an/a 1.02E+11n/an/an/an/an/an/a
Rashtrasant Tukadoji Maharaj Nagpur University
Curated by ChEMBL
Assay Description
Inhibition of MLCK (unknown origin) incubated for 15 mins using [gamma-32P]-ATP by scintillation counting method
Bioorg Med Chem 23: 6689-713 (2015)
BindingDB Entry DOI: 10.7270/Q2P55Q95
Myosin light chain kinase, smooth muscle
(Homo sapiens (Human))
BDBM50120602
(CHEMBL564992)
Show SMILES CCOC(=O)C1=C(C)NC(OC)N(CC(=O)c2ccccc2)C1c1ccc(O)cc1 |c:5|
Show InChI InChI=1S/C23H26N2O5/c1-4-30-22(28)20-15(2)24-23(29-3)25(14-19(27)16-8-6-5-7-9-16)21(20)17-10-12-18(26)13-11-17/h5-13,21,23-24,26H,4,14H2,1-3H3
n/an/a 1.02E+4n/an/an/an/an/an/a
Rashtrasant Tukadoji Maharaj Nagpur University
Curated by ChEMBL
Assay Description
Inhibition of MLCK (unknown origin) incubated for 15 mins using [gamma-32P]-ATP by scintillation counting method
Bioorg Med Chem 23: 6689-713 (2015)
BindingDB Entry DOI: 10.7270/Q2P55Q95