BDBM50120618 CHEMBL3618293
SMILES: CCC(=O)C1=C(C)N=C2Sc3ccccc3N2C1c1ccc(F)cc1
InChI Key: InChIKey=IFSUHMGUQFWOPR-UHFFFAOYSA-N
Data: 2 IC50
Activity Spreadsheet -- Enzyme Inhibition Constant Data from BindingDB
Found 2 hits for monomerid = 50120618
Trg + Lig
Ki
nM
ΔG°
kcal/mole
IC50
nM
Kd
nM
EC50/IC50
nM
koff
s-1
kon
M-1s-1
pHTemp
°C
Myosin light chain kinase, smooth muscle
(Homo sapiens (Human))
BDBM50120618
(CHEMBL3618293)
Show SMILES CCC(=O)C1=C(C)N=C2Sc3ccccc3N2C1c1ccc(F)cc1 |c:4,t:7|
Show InChI InChI=1S/C20H17FN2OS/c1-3-16(24)18-12(2)22-20-23(15-6-4-5-7-17(15)25-20)19(18)13-8-10-14(21)11-9-13/h4-11,19H,3H2,1-2H3
n/an/a 1.33E+11n/an/an/an/an/an/a
Rashtrasant Tukadoji Maharaj Nagpur University
Curated by ChEMBL
Assay Description
Inhibition of MLCK (unknown origin) incubated for 15 mins using [gamma-32P]-ATP by scintillation counting method
Bioorg Med Chem 23: 6689-713 (2015)
BindingDB Entry DOI: 10.7270/Q2P55Q95
Myosin light chain kinase, smooth muscle
(Homo sapiens (Human))
BDBM50120618
(CHEMBL3618293)
Show SMILES CCC(=O)C1=C(C)N=C2Sc3ccccc3N2C1c1ccc(F)cc1 |c:4,t:7|
Show InChI InChI=1S/C20H17FN2OS/c1-3-16(24)18-12(2)22-20-23(15-6-4-5-7-17(15)25-20)19(18)13-8-10-14(21)11-9-13/h4-11,19H,3H2,1-2H3
n/an/a 1.33E+4n/an/an/an/an/an/a
Rashtrasant Tukadoji Maharaj Nagpur University
Curated by ChEMBL
Assay Description
Inhibition of MLCK (unknown origin) incubated for 15 mins using [gamma-32P]-ATP by scintillation counting method
Bioorg Med Chem 23: 6689-713 (2015)
BindingDB Entry DOI: 10.7270/Q2P55Q95