BDBM50120621 CHEMBL1609840
SMILES: CC(=O)c1c(C)nc(Nc2nc3ccccc3s2)nc1C
InChI Key: InChIKey=ZIJFJKIWFDRCRB-UHFFFAOYSA-N
Data: 1 IC50
Activity Spreadsheet -- Enzyme Inhibition Constant Data from BindingDB
Found 1 hit for monomerid = 50120621
Trg + Lig
Ki
nM
ΔG°
kcal/mole
IC50
nM
Kd
nM
EC50/IC50
nM
koff
s-1
kon
M-1s-1
pHTemp
°C
Myosin light chain kinase, smooth muscle
(Homo sapiens (Human))
BDBM50120621
(CHEMBL1609840)
Show SMILES CC(=O)c1c(C)nc(Nc2nc3ccccc3s2)nc1C
Show InChI InChI=1S/C15H14N4OS/c1-8-13(10(3)20)9(2)17-14(16-8)19-15-18-11-6-4-5-7-12(11)21-15/h4-7H,1-3H3,(H,16,17,18,19)
n/an/a>1.00E+5n/an/an/an/an/an/a
Rashtrasant Tukadoji Maharaj Nagpur University
Curated by ChEMBL
Assay Description
Inhibition of MLCK (unknown origin) incubated for 15 mins using [gamma-32P]-ATP by scintillation counting method
Bioorg Med Chem 23: 6689-713 (2015)
BindingDB Entry DOI: 10.7270/Q2P55Q95