null
SMILES: C[C@H](CNCCc1cc[n+]([O-])cc1)c1c([nH]c2ccc(cc12)C(C)(C)C(=O)N1CC2CCC1CC2)-c1cc(C)cc(C)c1
InChI Key: InChIKey=WZUOLVKXEZUZND-WPCLDFDBSA-N
Activity Spreadsheet -- Enzyme Inhibition Constant Data from BindingDB
Found 2 hits for monomerid = 50120666
Trg + Lig
Ki
nM
ΔG°
kcal/mole
IC50
nM
Kd
nM
EC50/IC50
nM
koff
s-1
kon
M-1s-1
pHTemp
°C
Gonadotropin-releasing hormone receptor
(Homo sapiens (Human))
BDBM50120666
(1-(2-Aza-bicyclo[2.2.2]oct-2-yl)-2-(2-(3,5-dimethy...)
Show SMILES C[C@H](CNCCc1cc[n+]([O-])cc1)c1c([nH]c2ccc(cc12)C(C)(C)C(=O)N1CC2CCC1CC2)-c1cc(C)cc(C)c1 |wD:1.0,THB:25:27:31.30:33.34,(10.97,2.42,;11.45,.95,;12.96,.62,;14,1.76,;15.5,1.44,;16.55,2.56,;18.06,2.23,;18.5,.74,;20,.39,;21.05,1.53,;22.54,1.18,;20.62,2.98,;19.1,3.35,;10.4,-.22,;10.72,-1.71,;9.4,-2.48,;8.26,-1.47,;6.74,-1.63,;5.83,-.4,;6.45,1.02,;7.98,1.18,;8.88,-.05,;5.55,2.25,;4.62,3.51,;6.78,3.17,;4.29,1.35,;4.47,-.17,;2.9,1.96,;3.41,3.25,;2.15,4.23,;.68,3.96,;.09,2.68,;1.57,2.96,;1.78,4.86,;2.48,5.84,;12.19,-2.2,;12.5,-3.7,;13.96,-4.18,;14.27,-5.71,;15.12,-3.15,;14.79,-1.64,;15.94,-.61,;13.33,-1.17,)|
Show InChI InChI=1S/C37H46N4O2/c1-24-18-25(2)20-29(19-24)35-34(26(3)22-38-15-12-27-13-16-40(43)17-14-27)32-21-30(8-11-33(32)39-35)37(4,5)36(42)41-23-28-6-9-31(41)10-7-28/h8,11,13-14,16-21,26,28,31,38-39H,6-7,9-10,12,15,22-23H2,1-5H3/t26-,28?,31?/m1/s1
n/an/a 0.300n/an/an/an/an/an/a
Merck Research Laboratories
Curated by ChEMBL
Assay Description
Concentration required for the inhibition of I-125 labeled buserelin binding to the human Gonadotropin-releasing hormone receptor
Bioorg Med Chem Lett 12: 3329-32 (2002)
BindingDB Entry DOI: 10.7270/Q2668CHV
Gonadotropin-releasing hormone receptor
(Homo sapiens (Human))
BDBM50120666
(1-(2-Aza-bicyclo[2.2.2]oct-2-yl)-2-(2-(3,5-dimethy...)
Show SMILES C[C@H](CNCCc1cc[n+]([O-])cc1)c1c([nH]c2ccc(cc12)C(C)(C)C(=O)N1CC2CCC1CC2)-c1cc(C)cc(C)c1 |wD:1.0,THB:25:27:31.30:33.34,(10.97,2.42,;11.45,.95,;12.96,.62,;14,1.76,;15.5,1.44,;16.55,2.56,;18.06,2.23,;18.5,.74,;20,.39,;21.05,1.53,;22.54,1.18,;20.62,2.98,;19.1,3.35,;10.4,-.22,;10.72,-1.71,;9.4,-2.48,;8.26,-1.47,;6.74,-1.63,;5.83,-.4,;6.45,1.02,;7.98,1.18,;8.88,-.05,;5.55,2.25,;4.62,3.51,;6.78,3.17,;4.29,1.35,;4.47,-.17,;2.9,1.96,;3.41,3.25,;2.15,4.23,;.68,3.96,;.09,2.68,;1.57,2.96,;1.78,4.86,;2.48,5.84,;12.19,-2.2,;12.5,-3.7,;13.96,-4.18,;14.27,-5.71,;15.12,-3.15,;14.79,-1.64,;15.94,-.61,;13.33,-1.17,)|
Show InChI InChI=1S/C37H46N4O2/c1-24-18-25(2)20-29(19-24)35-34(26(3)22-38-15-12-27-13-16-40(43)17-14-27)32-21-30(8-11-33(32)39-35)37(4,5)36(42)41-23-28-6-9-31(41)10-7-28/h8,11,13-14,16-21,26,28,31,38-39H,6-7,9-10,12,15,22-23H2,1-5H3/t26-,28?,31?/m1/s1
n/an/a 6.40n/an/an/an/an/an/a
Merck Research Laboratories
Curated by ChEMBL
Assay Description
Concentration required for the inhibition of phosphatidyl inositol hydrolysis in chinese hamster ovary cells expressing human GnRH receptor (Gonadotr...
Bioorg Med Chem Lett 12: 3329-32 (2002)
BindingDB Entry DOI: 10.7270/Q2668CHV