BDBM50120693 CHEMBL359251::N-Hydroxy-2-{3-methyl-3-[4-(4-nitro-benzyloxy)-phenyl]-2-oxo-pyrrolidin-1-yl}-propionamide
SMILES: C[C@@H](N1CC[C@](C)(C1=O)c1ccc(OCc2ccc(cc2)[N+]([O-])=O)cc1)C(=O)NO
InChI Key: InChIKey=GOWUYJZGNHYGEC-SZNDQCEHSA-N
Data: 3 KI  1 IC50
Activity Spreadsheet -- Enzyme Inhibition Constant Data from BindingDB
Found 4 hits for monomerid = 50120693
Trg + Lig
Ki
nM
ΔG°
kcal/mole
IC50
nM
Kd
nM
EC50/IC50
nM
koff
s-1
kon
M-1s-1
pHTemp
°C
72 kDa type IV collagenase
(Homo sapiens (Human))
BDBM50120693
(CHEMBL359251 | N-Hydroxy-2-{3-methyl-3-[4-(4-nitro...)
Show SMILES C[C@@H](N1CC[C@](C)(C1=O)c1ccc(OCc2ccc(cc2)[N+]([O-])=O)cc1)C(=O)NO
Show InChI InChI=1S/C21H23N3O6/c1-14(19(25)22-27)23-12-11-21(2,20(23)26)16-5-9-18(10-6-16)30-13-15-3-7-17(8-4-15)24(28)29/h3-10,14,27H,11-13H2,1-2H3,(H,22,25)/t14-,21+/m1/s1
Reactome pathway
11n/an/an/an/an/an/an/an/a
Bristol-Myers Squibb Company
Curated by ChEMBL
Assay Description
Affinity for Matrix metalloprotease-2 (MMP-2)
J Med Chem 45: 4954-7 (2002)
BindingDB Entry DOI: 10.7270/Q2XP7497
Matrix metalloproteinase-9
(Homo sapiens (Human))
BDBM50120693
(CHEMBL359251 | N-Hydroxy-2-{3-methyl-3-[4-(4-nitro...)
Show SMILES C[C@@H](N1CC[C@](C)(C1=O)c1ccc(OCc2ccc(cc2)[N+]([O-])=O)cc1)C(=O)NO
Show InChI InChI=1S/C21H23N3O6/c1-14(19(25)22-27)23-12-11-21(2,20(23)26)16-5-9-18(10-6-16)30-13-15-3-7-17(8-4-15)24(28)29/h3-10,14,27H,11-13H2,1-2H3,(H,22,25)/t14-,21+/m1/s1
Reactome pathway
40n/an/an/an/an/an/an/an/a
Bristol-Myers Squibb Company
Curated by ChEMBL
Assay Description
Affinity towards Matrix metalloprotease-9 (MMP-9)
J Med Chem 45: 4954-7 (2002)
BindingDB Entry DOI: 10.7270/Q2XP7497
Interstitial collagenase
(Homo sapiens (Human))
BDBM50120693
(CHEMBL359251 | N-Hydroxy-2-{3-methyl-3-[4-(4-nitro...)
Show SMILES C[C@@H](N1CC[C@](C)(C1=O)c1ccc(OCc2ccc(cc2)[N+]([O-])=O)cc1)C(=O)NO
Show InChI InChI=1S/C21H23N3O6/c1-14(19(25)22-27)23-12-11-21(2,20(23)26)16-5-9-18(10-6-16)30-13-15-3-7-17(8-4-15)24(28)29/h3-10,14,27H,11-13H2,1-2H3,(H,22,25)/t14-,21+/m1/s1
Reactome pathway
>5.00E+3n/an/an/an/an/an/an/an/a
Bristol-Myers Squibb Company
Curated by ChEMBL
Assay Description
Affinity towards Matrix metalloprotease-1 (MMP-1)
J Med Chem 45: 4954-7 (2002)
BindingDB Entry DOI: 10.7270/Q2XP7497
Disintegrin and metalloproteinase domain-containing protein 17
(Sus scrofa (pig))
BDBM50120693
(CHEMBL359251 | N-Hydroxy-2-{3-methyl-3-[4-(4-nitro...)
Show SMILES C[C@@H](N1CC[C@](C)(C1=O)c1ccc(OCc2ccc(cc2)[N+]([O-])=O)cc1)C(=O)NO
Show InChI InChI=1S/C21H23N3O6/c1-14(19(25)22-27)23-12-11-21(2,20(23)26)16-5-9-18(10-6-16)30-13-15-3-7-17(8-4-15)24(28)29/h3-10,14,27H,11-13H2,1-2H3,(H,22,25)/t14-,21+/m1/s1
n/an/a 6n/an/an/an/an/an/a
Bristol-Myers Squibb Company
Curated by ChEMBL
Assay Description
Affinity for Tumor necrosis factor alpha converting enzyme (TACE)
J Med Chem 45: 4954-7 (2002)
BindingDB Entry DOI: 10.7270/Q2XP7497