BDBM50120991 CHEMBL3621444
SMILES: COCCN(C)c1nc(OC)c(NC(=O)CC(C)(C)C)c(OC)n1
InChI Key: InChIKey=RZADTOGEDSSOIX-UHFFFAOYSA-N
Data: 1 EC50
Activity Spreadsheet -- Enzyme Inhibition Constant Data from BindingDB
Found 1 hit for monomerid = 50120991
Trg + Lig
Ki
nM
ΔG°
kcal/mole
IC50
nM
Kd
nM
EC50/IC50
nM
koff
s-1
kon
M-1s-1
pHTemp
°C
Voltage-gated potassium channel subunit Kv7.2/Kv7.3
(Homo sapiens (Human))
BDBM50120991
(CHEMBL3621444)
Show SMILES COCCN(C)c1nc(OC)c(NC(=O)CC(C)(C)C)c(OC)n1
Show InChI InChI=1S/C16H28N4O4/c1-16(2,3)10-11(21)17-12-13(23-6)18-15(19-14(12)24-7)20(4)8-9-22-5/h8-10H2,1-7H3,(H,17,21)
n/an/an/an/a 206n/an/an/an/a
Pfizer Inc.
Curated by ChEMBL
Assay Description
Activation of human Kv7.2/7.3 expressed in CHOK1 cells
Bioorg Med Chem Lett 25: 4941-4 (2015)
BindingDB Entry DOI: 10.7270/Q28054FG