BDBM50121043 CHEMBL323637::[(S)-1-((R)-4,7-Dioxo-4-(R)-oxo-4lambda*6*-thia-1-aza-bicyclo[3.2.0]hept-6-ylcarbamoyl)-2-phenyl-ethyl]-carbamic acid benzyl ester
SMILES: O=C(N[C@@H](Cc1ccccc1)C(=O)N[C@H]1[C@@H]2N(CCS2(=O)=O)C1=O)OCc1ccccc1
InChI Key: InChIKey=PACZTXUZEYVPIY-WAOWUJCRSA-N
Data: 4 IC50
Activity Spreadsheet -- Enzyme Inhibition Constant Data from BindingDB
Found 4 hits for monomerid = 50121043
Trg + Lig
Ki
nM
ΔG°
kcal/mole
IC50
nM
Kd
nM
EC50/IC50
nM
koff
s-1
kon
M-1s-1
pHTemp
°C
Cathepsin B
(Homo sapiens (Human))
BDBM50121043
(CHEMBL323637 | [(S)-1-((R)-4,7-Dioxo-4-(R)-oxo-4la...)
Show SMILES O=C(N[C@@H](Cc1ccccc1)C(=O)N[C@H]1[C@@H]2N(CCS2(=O)=O)C1=O)OCc1ccccc1
Show InChI InChI=1S/C22H23N3O6S/c26-19(24-18-20(27)25-11-12-32(29,30)21(18)25)17(13-15-7-3-1-4-8-15)23-22(28)31-14-16-9-5-2-6-10-16/h1-10,17-18,21H,11-14H2,(H,23,28)(H,24,26)/t17-,18+,21+/m0/s1
Reactome pathway
n/an/a 6.01E+3n/an/an/an/an/an/a
currently NAEJA Pharmaceutical Inc.
Curated by ChEMBL
Assay Description
Inhibitory activity of Cbz-Phe-Arg-AMC against Cathepsin B cysteine protease
Bioorg Med Chem Lett 12: 3417-9 (2002)
BindingDB Entry DOI: 10.7270/Q280520T
Cathepsin S
(Homo sapiens (Human))
BDBM50121043
(CHEMBL323637 | [(S)-1-((R)-4,7-Dioxo-4-(R)-oxo-4la...)
Show SMILES O=C(N[C@@H](Cc1ccccc1)C(=O)N[C@H]1[C@@H]2N(CCS2(=O)=O)C1=O)OCc1ccccc1
Show InChI InChI=1S/C22H23N3O6S/c26-19(24-18-20(27)25-11-12-32(29,30)21(18)25)17(13-15-7-3-1-4-8-15)23-22(28)31-14-16-9-5-2-6-10-16/h1-10,17-18,21H,11-14H2,(H,23,28)(H,24,26)/t17-,18+,21+/m0/s1
Reactome pathway
n/an/a 210n/an/an/an/an/an/a
currently NAEJA Pharmaceutical Inc.
Curated by ChEMBL
Assay Description
In vitro Inhibitory activity of the compound was determined against Cathepsin S cysteine protease by using Cbz-Val-Arg-AMC
Bioorg Med Chem Lett 12: 3417-9 (2002)
BindingDB Entry DOI: 10.7270/Q280520T
Cathepsin K
(Homo sapiens (Human))
BDBM50121043
(CHEMBL323637 | [(S)-1-((R)-4,7-Dioxo-4-(R)-oxo-4la...)
Show SMILES O=C(N[C@@H](Cc1ccccc1)C(=O)N[C@H]1[C@@H]2N(CCS2(=O)=O)C1=O)OCc1ccccc1
Show InChI InChI=1S/C22H23N3O6S/c26-19(24-18-20(27)25-11-12-32(29,30)21(18)25)17(13-15-7-3-1-4-8-15)23-22(28)31-14-16-9-5-2-6-10-16/h1-10,17-18,21H,11-14H2,(H,23,28)(H,24,26)/t17-,18+,21+/m0/s1
Reactome pathway
n/an/a 7.5n/an/an/an/an/an/a
currently NAEJA Pharmaceutical Inc.
Curated by ChEMBL
Assay Description
Inhibition of Cbz-Phe-Arg-AMC binding to Cathepsin K cysteine protease
Bioorg Med Chem Lett 12: 3417-9 (2002)
BindingDB Entry DOI: 10.7270/Q280520T
Cathepsin L
(Rattus norvegicus)
BDBM50121043
(CHEMBL323637 | [(S)-1-((R)-4,7-Dioxo-4-(R)-oxo-4la...)
Show SMILES O=C(N[C@@H](Cc1ccccc1)C(=O)N[C@H]1[C@@H]2N(CCS2(=O)=O)C1=O)OCc1ccccc1
Show InChI InChI=1S/C22H23N3O6S/c26-19(24-18-20(27)25-11-12-32(29,30)21(18)25)17(13-15-7-3-1-4-8-15)23-22(28)31-14-16-9-5-2-6-10-16/h1-10,17-18,21H,11-14H2,(H,23,28)(H,24,26)/t17-,18+,21+/m0/s1
Reactome pathway
n/an/a 9.60n/an/an/an/an/an/a
currently NAEJA Pharmaceutical Inc.
Curated by ChEMBL
Assay Description
Inhibition of Cbz-Phe-Arg-AMC binding to Cathepsin L cysteine protease
Bioorg Med Chem Lett 12: 3417-9 (2002)
BindingDB Entry DOI: 10.7270/Q280520T