BDBM50121053 CHEMBL3621439
SMILES: COc1nc(nc(OC)c1NC(=O)CC(C)(C)C)N1CCC(F)(F)CC1
InChI Key: InChIKey=UDMSEIUBTPBILD-UHFFFAOYSA-N
Data: 1 EC50
Activity Spreadsheet -- Enzyme Inhibition Constant Data from BindingDB
Found 1 hit for monomerid = 50121053
Trg + Lig
Ki
nM
ΔG°
kcal/mole
IC50
nM
Kd
nM
EC50/IC50
nM
koff
s-1
kon
M-1s-1
pHTemp
°C
Voltage-gated potassium channel subunit Kv7.2/Kv7.3
(Homo sapiens (Human))
BDBM50121053
(CHEMBL3621439)
Show SMILES COc1nc(nc(OC)c1NC(=O)CC(C)(C)C)N1CCC(F)(F)CC1
Show InChI InChI=1S/C17H26F2N4O3/c1-16(2,3)10-11(24)20-12-13(25-4)21-15(22-14(12)26-5)23-8-6-17(18,19)7-9-23/h6-10H2,1-5H3,(H,20,24)
n/an/an/an/a 50n/an/an/an/a
Pfizer Inc.
Curated by ChEMBL
Assay Description
Activation of human Kv7.2/7.3 expressed in CHOK1 cells
Bioorg Med Chem Lett 25: 4941-4 (2015)
BindingDB Entry DOI: 10.7270/Q28054FG