BDBM50121153 3-{[5-(3-Cyclopropyl-5,6,7,8-tetrahydro-[1,8]naphthyridin-2-yl)-pentanoyl]-methyl-amino}-2-(2,3-dihydro-benzofuran-6-yl)-propionic acid::CHEMBL330956
SMILES: CN(CC(C(O)=O)c1ccc2CCOc2c1)C(=O)CCCCc1nc2NCCCc2cc1C1CC1
InChI Key: InChIKey=RXTBIRIYBNVLMP-UHFFFAOYSA-N
Data: 1 IC50
Activity Spreadsheet -- Enzyme Inhibition Constant Data from BindingDB
Found 1 hit for monomerid = 50121153
Trg + Lig
Ki
nM
ΔG°
kcal/mole
IC50
nM
Kd
nM
EC50/IC50
nM
koff
s-1
kon
M-1s-1
pHTemp
°C
Integrin alpha-V/beta-3
(Homo sapiens (Human))
BDBM50121153
(3-{[5-(3-Cyclopropyl-5,6,7,8-tetrahydro-[1,8]napht...)
Show SMILES CN(CC(C(O)=O)c1ccc2CCOc2c1)C(=O)CCCCc1nc2NCCCc2cc1C1CC1
Show InChI InChI=1S/C28H35N3O4/c1-31(17-23(28(33)34)20-11-10-19-12-14-35-25(19)16-20)26(32)7-3-2-6-24-22(18-8-9-18)15-21-5-4-13-29-27(21)30-24/h10-11,15-16,18,23H,2-9,12-14,17H2,1H3,(H,29,30)(H,33,34)
n/an/a 0.490n/an/an/an/an/an/a
Merck Research Laboratories
Curated by ChEMBL
Assay Description
Inhibition of binding to human integrin receptor alpha V beta3
Bioorg Med Chem Lett 12: 3483-6 (2002)
BindingDB Entry DOI: 10.7270/Q26974S6