BDBM50121267 5-(2-Acetylamino-hexanoylamino)-19-[3-(diaminomethaniminium)-propyl]-16-(1H-indol-3-ylmethyl)-22-naphthalen-2-ylmethyl-4,7,15,18,21,24-hexaoxo-tetracosahydro-3a,8,14,17,20,23-hexaaza-cyclopentacyclotricosene-13-carboxylic acid amide::CID44366214::PG-901
SMILES: CCCC[C@@H](NC(C)=O)C(=O)N[C@@H]1CC(=O)NCCCC[C@H](NC(=O)[C@H](Cc2c[nH]c3ccccc23)NC(=O)[C@@H](CCCNC(N)=[NH2+])NC(=O)[C@H](Cc2ccc3ccccc3c2)NC(=O)[C@H]2CCCN2C1=O)C(N)=O
InChI Key: InChIKey=JNEKRCCXHUFBPL-RBGSVQRDSA-O
Data: 3 IC50  1 EC50
Activity Spreadsheet -- Enzyme Inhibition Constant Data from BindingDB
Found 4 hits for monomerid = 50121267
Trg + Lig
Ki
nM
ΔG°
kcal/mole
IC50
nM
Kd
nM
EC50/IC50
nM
koff
s-1
kon
M-1s-1
pHTemp
°C
Melanocortin receptor 3
(Homo sapiens (Human))
BDBM50121267
(5-(2-Acetylamino-hexanoylamino)-19-[3-(diaminometh...)
Show SMILES CCCC[C@@H](NC(C)=O)C(=O)N[C@@H]1CC(=O)NCCCC[C@H](NC(=O)[C@H](Cc2c[nH]c3ccccc23)NC(=O)[C@@H](CCCNC(N)=[NH2+])NC(=O)[C@H](Cc2ccc3ccccc3c2)NC(=O)[C@H]2CCCN2C1=O)C(N)=O
Show InChI InChI=1S/C53H71N13O9/c1-3-4-16-39(60-31(2)67)47(70)65-43-29-45(68)57-23-10-9-18-38(46(54)69)61-50(73)42(28-35-30-59-37-17-8-7-15-36(35)37)63-48(71)40(19-11-24-58-53(55)56)62-49(72)41(64-51(74)44-20-12-25-66(44)52(43)75)27-32-21-22-33-13-5-6-14-34(33)26-32/h5-8,13-15,17,21-22,26,30,38-44,59H,3-4,9-12,16,18-20,23-25,27-29H2,1-2H3,(H2,54,69)(H,57,68)(H,60,67)(H,61,73)(H,62,72)(H,63,71)(H,64,74)(H,65,70)(H4,55,56,58)/p+1/t38-,39+,40+,41-,42-,43+,44+/m0/s1
n/an/a 0.190n/an/an/an/an/an/a
University of Arizona
Curated by ChEMBL
Assay Description
Binding affinity for human Melanocortin-3 receptor
J Med Chem 45: 5287-94 (2002)
BindingDB Entry DOI: 10.7270/Q20G3KW8
Melanocortin receptor 4
(Homo sapiens (Human))
BDBM50121267
(5-(2-Acetylamino-hexanoylamino)-19-[3-(diaminometh...)
Show SMILES CCCC[C@@H](NC(C)=O)C(=O)N[C@@H]1CC(=O)NCCCC[C@H](NC(=O)[C@H](Cc2c[nH]c3ccccc23)NC(=O)[C@@H](CCCNC(N)=[NH2+])NC(=O)[C@H](Cc2ccc3ccccc3c2)NC(=O)[C@H]2CCCN2C1=O)C(N)=O
Show InChI InChI=1S/C53H71N13O9/c1-3-4-16-39(60-31(2)67)47(70)65-43-29-45(68)57-23-10-9-18-38(46(54)69)61-50(73)42(28-35-30-59-37-17-8-7-15-36(35)37)63-48(71)40(19-11-24-58-53(55)56)62-49(72)41(64-51(74)44-20-12-25-66(44)52(43)75)27-32-21-22-33-13-5-6-14-34(33)26-32/h5-8,13-15,17,21-22,26,30,38-44,59H,3-4,9-12,16,18-20,23-25,27-29H2,1-2H3,(H2,54,69)(H,57,68)(H,60,67)(H,61,73)(H,62,72)(H,63,71)(H,64,74)(H,65,70)(H4,55,56,58)/p+1/t38-,39+,40+,41-,42-,43+,44+/m0/s1
n/an/a 0.0900n/an/an/an/an/an/a
University of Arizona
Curated by ChEMBL
Assay Description
Binding affinity against human Melanocortin-4 receptor
J Med Chem 45: 5287-94 (2002)
BindingDB Entry DOI: 10.7270/Q20G3KW8
Melanocortin receptor 5 (MC5R)
(Homo sapiens (Human))
BDBM50121267
(5-(2-Acetylamino-hexanoylamino)-19-[3-(diaminometh...)
Show SMILES CCCC[C@@H](NC(C)=O)C(=O)N[C@@H]1CC(=O)NCCCC[C@H](NC(=O)[C@H](Cc2c[nH]c3ccccc23)NC(=O)[C@@H](CCCNC(N)=[NH2+])NC(=O)[C@H](Cc2ccc3ccccc3c2)NC(=O)[C@H]2CCCN2C1=O)C(N)=O
Show InChI InChI=1S/C53H71N13O9/c1-3-4-16-39(60-31(2)67)47(70)65-43-29-45(68)57-23-10-9-18-38(46(54)69)61-50(73)42(28-35-30-59-37-17-8-7-15-36(35)37)63-48(71)40(19-11-24-58-53(55)56)62-49(72)41(64-51(74)44-20-12-25-66(44)52(43)75)27-32-21-22-33-13-5-6-14-34(33)26-32/h5-8,13-15,17,21-22,26,30,38-44,59H,3-4,9-12,16,18-20,23-25,27-29H2,1-2H3,(H2,54,69)(H,57,68)(H,60,67)(H,61,73)(H,62,72)(H,63,71)(H,64,74)(H,65,70)(H4,55,56,58)/p+1/t38-,39+,40+,41-,42-,43+,44+/m0/s1
n/an/a 0.0300n/an/an/an/an/an/a
University of Arizona
Curated by ChEMBL
Assay Description
Binding affinity against human Melanocortin 5 receptor
J Med Chem 45: 5287-94 (2002)
BindingDB Entry DOI: 10.7270/Q20G3KW8
Melanocortin receptor 5 (MC5R)
(Homo sapiens (Human))
BDBM50121267
(5-(2-Acetylamino-hexanoylamino)-19-[3-(diaminometh...)
Show SMILES CCCC[C@@H](NC(C)=O)C(=O)N[C@@H]1CC(=O)NCCCC[C@H](NC(=O)[C@H](Cc2c[nH]c3ccccc23)NC(=O)[C@@H](CCCNC(N)=[NH2+])NC(=O)[C@H](Cc2ccc3ccccc3c2)NC(=O)[C@H]2CCCN2C1=O)C(N)=O
Show InChI InChI=1S/C53H71N13O9/c1-3-4-16-39(60-31(2)67)47(70)65-43-29-45(68)57-23-10-9-18-38(46(54)69)61-50(73)42(28-35-30-59-37-17-8-7-15-36(35)37)63-48(71)40(19-11-24-58-53(55)56)62-49(72)41(64-51(74)44-20-12-25-66(44)52(43)75)27-32-21-22-33-13-5-6-14-34(33)26-32/h5-8,13-15,17,21-22,26,30,38-44,59H,3-4,9-12,16,18-20,23-25,27-29H2,1-2H3,(H2,54,69)(H,57,68)(H,60,67)(H,61,73)(H,62,72)(H,63,71)(H,64,74)(H,65,70)(H4,55,56,58)/p+1/t38-,39+,40+,41-,42-,43+,44+/m0/s1
n/an/an/an/a 0.0700n/an/an/an/a
University of Arizona
Curated by ChEMBL
Assay Description
Binding affinity against human Melanocortin 5 receptor
J Med Chem 45: 5287-94 (2002)
BindingDB Entry DOI: 10.7270/Q20G3KW8