BDBM50121345 CHEMBL3622104::US9751881, Example 1
SMILES: Cc1c2COC(=O)c2ccc1[C@@H](O)CN1CCC2(CN(C(=O)C2)c2ccc(cn2)C#N)CC1
InChI Key: InChIKey=WOQONCRZLPNXNO-NRFANRHFSA-N
Data: 4 IC50
Activity Spreadsheet -- Enzyme Inhibition Constant Data from BindingDB
Found 4 hits for monomerid = 50121345
Trg + Lig
Ki
nM
ΔG°
kcal/mole
IC50
nM
Kd
nM
EC50/IC50
nM
koff
s-1
kon
M-1s-1
pHTemp
°C
ATP-sensitive inward rectifier potassium channel 1
(Homo sapiens (Human))
BDBM50121345
(CHEMBL3622104 | US9751881, Example 1)
Show SMILES Cc1c2COC(=O)c2ccc1[C@@H](O)CN1CCC2(CN(C(=O)C2)c2ccc(cn2)C#N)CC1 |r|
Show InChI InChI=1S/C25H26N4O4/c1-16-18(3-4-19-20(16)14-33-24(19)32)21(30)13-28-8-6-25(7-9-28)10-23(31)29(15-25)22-5-2-17(11-26)12-27-22/h2-5,12,21,30H,6-10,13-15H2,1H3/t21-/m0/s1
Reactome pathway
n/an/a 11n/an/an/an/an/an/a
Temple University School of Pharmacy
Curated by ChEMBL
Assay Description
Inhibition of human Kir1.1 expressed in HEK293 cells by thallium flux assay
ACS Med Chem Lett 6: 831-3 (2015)
BindingDB Entry DOI: 10.7270/Q2377BHG
ATP-sensitive inward rectifier potassium channel 1
(Homo sapiens (Human))
BDBM50121345
(CHEMBL3622104 | US9751881, Example 1)
Show SMILES Cc1c2COC(=O)c2ccc1[C@@H](O)CN1CCC2(CN(C(=O)C2)c2ccc(cn2)C#N)CC1 |r|
Show InChI InChI=1S/C25H26N4O4/c1-16-18(3-4-19-20(16)14-33-24(19)32)21(30)13-28-8-6-25(7-9-28)10-23(31)29(15-25)22-5-2-17(11-26)12-27-22/h2-5,12,21,30H,6-10,13-15H2,1H3/t21-/m0/s1
Reactome pathway
US Patent
n/an/a 10.5n/an/an/an/an/an/a
Merck Sharp & Dohme Corp.
US Patent
Assay Description
Assay Protocol: The ROMK channel functional thallium flux assay was performed in 384 wells, using the FLIPR-Tetra instrument. HEK-hKir1.1 cells were ...
US Patent US9751881 (2017)
BindingDB Entry DOI: 10.7270/Q26M38ZP
1,3-beta-glucan synthase component GSC2
(Saccharomyces cerevisiae)
BDBM50121345
(CHEMBL3622104 | US9751881, Example 1)
Show SMILES Cc1c2COC(=O)c2ccc1[C@@H](O)CN1CCC2(CN(C(=O)C2)c2ccc(cn2)C#N)CC1 |r|
Show InChI InChI=1S/C25H26N4O4/c1-16-18(3-4-19-20(16)14-33-24(19)32)21(30)13-28-8-6-25(7-9-28)10-23(31)29(15-25)22-5-2-17(11-26)12-27-22/h2-5,12,21,30H,6-10,13-15H2,1H3/t21-/m0/s1
n/an/a 1.80E+3n/an/an/an/an/an/a
Merck& Co. Inc.
Curated by ChEMBL
Assay Description
Displacement of [35S]MK499 from human ERG expressed in HEK293 cells
Bioorg Med Chem Lett 27: 1109-1114 (2017)
Article DOI: 10.1016/j.bmcl.2016.10.032
BindingDB Entry DOI: 10.7270/Q2T43WC8
ATP-sensitive inward rectifier potassium channel 1
(Homo sapiens (Human))
BDBM50121345
(CHEMBL3622104 | US9751881, Example 1)
Show SMILES Cc1c2COC(=O)c2ccc1[C@@H](O)CN1CCC2(CN(C(=O)C2)c2ccc(cn2)C#N)CC1 |r|
Show InChI InChI=1S/C25H26N4O4/c1-16-18(3-4-19-20(16)14-33-24(19)32)21(30)13-28-8-6-25(7-9-28)10-23(31)29(15-25)22-5-2-17(11-26)12-27-22/h2-5,12,21,30H,6-10,13-15H2,1H3/t21-/m0/s1
Reactome pathway
n/an/a 10n/an/an/an/an/an/a
Merck& Co. Inc.
Curated by ChEMBL
Assay Description
In vitro 100 nM cortex affinity to displace [3H]- -CD providing a measure of muscarinic m1 receptor agonist affinity
Bioorg Med Chem Lett 27: 1109-1114 (2017)
Article DOI: 10.1016/j.bmcl.2016.10.032
BindingDB Entry DOI: 10.7270/Q2T43WC8