null
SMILES: [O-]C(=O)c1cc(OCc2cccs2)ccc1NC(=O)c1ccc(Cl)cc1Cl
InChI Key: InChIKey=RHNGSZQNJSTEEB-UHFFFAOYSA-M
Activity Spreadsheet -- Enzyme Inhibition Constant Data from BindingDB
Found 4 hits for monomerid = 50121422
Trg + Lig
Ki
nM
ΔG°
kcal/mole
IC50
nM
Kd
nM
EC50/IC50
nM
koff
s-1
kon
M-1s-1
pHTemp
°C
Peroxisome proliferator-activated receptor gamma
(Homo sapiens (Human))
BDBM50121422
(CHEMBL119869 | Lithium; 2-(2,4-dichloro-benzoylami...)
Show SMILES [O-]C(=O)c1cc(OCc2cccs2)ccc1NC(=O)c1ccc(Cl)cc1Cl
Show InChI InChI=1S/C19H13Cl2NO4S/c20-11-3-5-14(16(21)8-11)18(23)22-17-6-4-12(9-15(17)19(24)25)26-10-13-2-1-7-27-13/h1-9H,10H2,(H,22,23)(H,24,25)/p-1
NCI pathway
Reactome pathway
400n/an/an/an/an/an/an/an/a
Biovitrum AB
Curated by ChEMBL
Assay Description
Ligand binding affinity was determined by displacement of a tritiated tracer by the unlabeled compound to a GST-PPAR fusion protein for Peroxisome pr...
Bioorg Med Chem Lett 12: 3565-7 (2002)
BindingDB Entry DOI: 10.7270/Q2Q23ZK5
Peroxisome proliferator-activated receptor alpha
(Homo sapiens (Human))
BDBM50121422
(CHEMBL119869 | Lithium; 2-(2,4-dichloro-benzoylami...)
Show SMILES [O-]C(=O)c1cc(OCc2cccs2)ccc1NC(=O)c1ccc(Cl)cc1Cl
Show InChI InChI=1S/C19H13Cl2NO4S/c20-11-3-5-14(16(21)8-11)18(23)22-17-6-4-12(9-15(17)19(24)25)26-10-13-2-1-7-27-13/h1-9H,10H2,(H,22,23)(H,24,25)/p-1
2.50E+4n/an/an/an/an/an/an/an/a
Biovitrum AB
Curated by ChEMBL
Assay Description
Ligand binding affinity was determined by displacement of a tritiated tracer by the unlabeled compound to a GST-PPAR fusion protein for Peroxisome pr...
Bioorg Med Chem Lett 12: 3565-7 (2002)
BindingDB Entry DOI: 10.7270/Q2Q23ZK5
Peroxisome proliferator-activated receptor gamma
(Homo sapiens (Human))
BDBM50121422
(CHEMBL119869 | Lithium; 2-(2,4-dichloro-benzoylami...)
Show SMILES [O-]C(=O)c1cc(OCc2cccs2)ccc1NC(=O)c1ccc(Cl)cc1Cl
Show InChI InChI=1S/C19H13Cl2NO4S/c20-11-3-5-14(16(21)8-11)18(23)22-17-6-4-12(9-15(17)19(24)25)26-10-13-2-1-7-27-13/h1-9H,10H2,(H,22,23)(H,24,25)/p-1
NCI pathway
Reactome pathway
n/an/an/an/a 300n/an/an/an/a
Biovitrum AB
Curated by ChEMBL
Assay Description
Transactivation potency was measured by luciferase activity in Caco- 2/TC7 cells transiently co-transfected for the fusion-protein Gal4-PPAR gamma
Bioorg Med Chem Lett 12: 3565-7 (2002)
BindingDB Entry DOI: 10.7270/Q2Q23ZK5
Peroxisome proliferator-activated receptor alpha
(Homo sapiens (Human))
BDBM50121422
(CHEMBL119869 | Lithium; 2-(2,4-dichloro-benzoylami...)
Show SMILES [O-]C(=O)c1cc(OCc2cccs2)ccc1NC(=O)c1ccc(Cl)cc1Cl
Show InChI InChI=1S/C19H13Cl2NO4S/c20-11-3-5-14(16(21)8-11)18(23)22-17-6-4-12(9-15(17)19(24)25)26-10-13-2-1-7-27-13/h1-9H,10H2,(H,22,23)(H,24,25)/p-1
n/an/an/an/a 5.00E+3n/an/an/an/a
Biovitrum AB
Curated by ChEMBL
Assay Description
Transactivation potency was measured by luciferase activity in Caco- 2/TC7 cells transiently co-transfected for the fusion-protein Gal4-PPAR gamma
Bioorg Med Chem Lett 12: 3565-7 (2002)
BindingDB Entry DOI: 10.7270/Q2Q23ZK5