BDBM50121436 (R)-2-Hydrazinocarbonylmethyl-hexanoic acid ((S)-1-dimethylcarbamoyl-2,2-dimethyl-propyl)-amide::CHEMBL120479
SMILES: CCCC[C@H](CC(=O)NN)C(=O)N[C@H](C(=O)N(C)C)C(C)(C)C
InChI Key: InChIKey=BHSQAPDDBWMWPW-DGCLKSJQSA-N
Data: 1 IC50
Activity Spreadsheet -- Enzyme Inhibition Constant Data from BindingDB
Found 1 hit for monomerid = 50121436
Trg + Lig
Ki
nM
ΔG°
kcal/mole
IC50
nM
Kd
nM
EC50/IC50
nM
koff
s-1
kon
M-1s-1
pHTemp
°C
Peptide deformylase mitochondrial
(Homo sapiens (Human))
BDBM50121436
((R)-2-Hydrazinocarbonylmethyl-hexanoic acid ((S)-1...)
Show SMILES CCCC[C@H](CC(=O)NN)C(=O)N[C@H](C(=O)N(C)C)C(C)(C)C
Show InChI InChI=1S/C16H32N4O3/c1-7-8-9-11(10-12(21)19-17)14(22)18-13(16(2,3)4)15(23)20(5)6/h11,13H,7-10,17H2,1-6H3,(H,18,22)(H,19,21)/t11-,13-/m1/s1
n/an/a 200n/an/an/an/an/an/a
British Biotech Pharmaceuticals Limited
Curated by ChEMBL
Assay Description
Compound was evaluated for inhibition of peptide deformylase, PDF.Ni of Escherichia coli
Bioorg Med Chem Lett 12: 3595-9 (2002)
BindingDB Entry DOI: 10.7270/Q2FJ2G4H