BDBM50121439 (2R)-2-{[(aminocarbonyl)(hydroxy)amino]methyl}-N-{(1S)-1-[(dimethylamino)carbonyl]-(2,2-dimethyl)-propyl}hexanamide::CHEMBL120155
SMILES: CCCC[C@H](CN(O)C(N)=O)C(=O)N[C@H](C(=O)N(C)C)C(C)(C)C
InChI Key: InChIKey=WQEWYIKQXRBNQZ-VXGBXAGGSA-N
Data: 1 IC50
Activity Spreadsheet -- Enzyme Inhibition Constant Data from BindingDB
Found 1 hit for monomerid = 50121439
Trg + Lig
Ki
nM
ΔG°
kcal/mole
IC50
nM
Kd
nM
EC50/IC50
nM
koff
s-1
kon
M-1s-1
pHTemp
°C
Peptide deformylase mitochondrial
(Homo sapiens (Human))
BDBM50121439
((2R)-2-{[(aminocarbonyl)(hydroxy)amino]methyl}-N-{...)
Show SMILES CCCC[C@H](CN(O)C(N)=O)C(=O)N[C@H](C(=O)N(C)C)C(C)(C)C
Show InChI InChI=1S/C16H32N4O4/c1-7-8-9-11(10-20(24)15(17)23)13(21)18-12(16(2,3)4)14(22)19(5)6/h11-12,24H,7-10H2,1-6H3,(H2,17,23)(H,18,21)/t11-,12-/m1/s1
n/an/a>1.00E+3n/an/an/an/an/an/a
British Biotech Pharmaceuticals Limited
Curated by ChEMBL
Assay Description
Compound was evaluated for inhibition of peptide deformylase, PDF.Ni of Escherichia coli
Bioorg Med Chem Lett 12: 3595-9 (2002)
BindingDB Entry DOI: 10.7270/Q2FJ2G4H