BDBM50121505 2,5-Bis-benzyloxy-3,4-dihydroxy-hexanedioic acid benzylamide (2-hydroxy-indan-1-yl)-amide::CHEMBL358924
SMILES: O[C@H]([C@@H](O)[C@@H](OCc1ccccc1)C(=O)NC1[C@H](O)Cc2ccccc12)[C@@H](OCc1ccccc1)C(=O)NCc1ccccc1
InChI Key: InChIKey=KMCYORONTQQGJB-BNARLICOSA-N
Data: 1 KI  1 Kd  1 Koff  1 Kon
Activity Spreadsheet -- Enzyme Inhibition Constant Data from BindingDB
Found 2 hits for monomerid = 50121505
Trg + Lig
Ki
nM
ΔG°
kcal/mole
IC50
nM
Kd
nM
EC50/IC50
nM
koff
s-1
kon
M-1s-1
pHTemp
°C
Human immunodeficiency virus type 1 protease
(Human immunodeficiency virus type 1)
BDBM50121505
(2,5-Bis-benzyloxy-3,4-dihydroxy-hexanedioic acid b...)
Show SMILES O[C@H]([C@@H](O)[C@@H](OCc1ccccc1)C(=O)NC1[C@H](O)Cc2ccccc12)[C@@H](OCc1ccccc1)C(=O)NCc1ccccc1
Show InChI InChI=1S/C36H38N2O7/c39-29-20-27-18-10-11-19-28(27)30(29)38-36(43)34(45-23-26-16-8-3-9-17-26)32(41)31(40)33(44-22-25-14-6-2-7-15-25)35(42)37-21-24-12-4-1-5-13-24/h1-19,29-34,39-41H,20-23H2,(H,37,42)(H,38,43)/t29-,30?,31-,32-,33-,34-/m1/s1
0.100n/an/a 70n/an/a 1.01E+5n/an/a
Uppsala University
Curated by ChEMBL
Assay Description
Association rate constant for the interaction between inhibitor and HIV-1 protease
J Med Chem 45: 5430-9 (2002)
BindingDB Entry DOI: 10.7270/Q2GH9JP4
Human immunodeficiency virus type 1 protease
(Human immunodeficiency virus type 1)
BDBM50121505
(2,5-Bis-benzyloxy-3,4-dihydroxy-hexanedioic acid b...)
Show SMILES O[C@H]([C@@H](O)[C@@H](OCc1ccccc1)C(=O)NC1[C@H](O)Cc2ccccc12)[C@@H](OCc1ccccc1)C(=O)NCc1ccccc1
Show InChI InChI=1S/C36H38N2O7/c39-29-20-27-18-10-11-19-28(27)30(29)38-36(43)34(45-23-26-16-8-3-9-17-26)32(41)31(40)33(44-22-25-14-6-2-7-15-25)35(42)37-21-24-12-4-1-5-13-24/h1-19,29-34,39-41H,20-23H2,(H,37,42)(H,38,43)/t29-,30?,31-,32-,33-,34-/m1/s1
n/an/an/an/an/a 6.5n/an/an/a
Uppsala University
Curated by ChEMBL
Assay Description
Association rate constant for the interaction between inhibitor and HIV-1 protease
J Med Chem 45: 5430-9 (2002)
BindingDB Entry DOI: 10.7270/Q2GH9JP4