BDBM50121543 CHEMBL435440::Morpholine-4-carboxylic acid {1-[(cyano-phenyl-methyl)-carbamoyl]-2-cyclohexyl-ethyl}-amide
SMILES: O=C(N[C@H](C#N)c1ccccc1)[C@H](CC1CCCCC1)NC(=O)N1CCOCC1
InChI Key: InChIKey=RPEOGYHALGWHII-VQTJNVASSA-N
Data: 1 IC50  1 Kd
Activity Spreadsheet -- Enzyme Inhibition Constant Data from BindingDB
Found 2 hits for monomerid = 50121543
Trg + Lig
Ki
nM
ΔG°
kcal/mole
IC50
nM
Kd
nM
EC50/IC50
nM
koff
s-1
kon
M-1s-1
pHTemp
°C
Cathepsin S
(Homo sapiens (Human))
BDBM50121543
(CHEMBL435440 | Morpholine-4-carboxylic acid {1-[(c...)
Show SMILES O=C(N[C@H](C#N)c1ccccc1)[C@H](CC1CCCCC1)NC(=O)N1CCOCC1
Show InChI InChI=1S/C22H30N4O3/c23-16-20(18-9-5-2-6-10-18)24-21(27)19(15-17-7-3-1-4-8-17)25-22(28)26-11-13-29-14-12-26/h2,5-6,9-10,17,19-20H,1,3-4,7-8,11-15H2,(H,24,27)(H,25,28)/t19-,20+/m0/s1
Reactome pathway
n/an/a 9n/an/an/an/an/an/a
Boehringer Ingelheim Pharmaceuticals
Curated by ChEMBL
Assay Description
Inhibitory concentration against human recombinant Cathepsin S expressed in baculovirus
J Med Chem 45: 5471-82 (2002)
BindingDB Entry DOI: 10.7270/Q2P26XG7
Cathepsin S
(Homo sapiens (Human))
BDBM50121543
(CHEMBL435440 | Morpholine-4-carboxylic acid {1-[(c...)
Show SMILES O=C(N[C@H](C#N)c1ccccc1)[C@H](CC1CCCCC1)NC(=O)N1CCOCC1
Show InChI InChI=1S/C22H30N4O3/c23-16-20(18-9-5-2-6-10-18)24-21(27)19(15-17-7-3-1-4-8-17)25-22(28)26-11-13-29-14-12-26/h2,5-6,9-10,17,19-20H,1,3-4,7-8,11-15H2,(H,24,27)(H,25,28)/t19-,20+/m0/s1
Reactome pathway
n/an/an/a 1n/an/an/an/an/a
Boehringer Ingelheim Pharmaceuticals
Curated by ChEMBL
Assay Description
Equilibrium dissocation constant determined using fluorescence based competitive binding assay towards Cathepsin S
J Med Chem 45: 5471-82 (2002)
BindingDB Entry DOI: 10.7270/Q2P26XG7