BDBM50121707 CHEMBL3617010
SMILES: Oc1ccc(CNC(=O)Cc2ccc(cc2)N2CCOCC2)cc1O
InChI Key: InChIKey=HAEOPMKCJVQCFY-UHFFFAOYSA-N
Data: 2 IC50
Activity Spreadsheet -- Enzyme Inhibition Constant Data from BindingDB
Found 2 hits for monomerid = 50121707
Trg + Lig
Ki
nM
ΔG°
kcal/mole
IC50
nM
Kd
nM
EC50/IC50
nM
koff
s-1
kon
M-1s-1
pHTemp
°C
Deoxyribonuclease-1
(Homo sapiens (Human))
BDBM50121707
(CHEMBL3617010)
Show SMILES Oc1ccc(CNC(=O)Cc2ccc(cc2)N2CCOCC2)cc1O
Show InChI InChI=1S/C19H22N2O4/c22-17-6-3-15(11-18(17)23)13-20-19(24)12-14-1-4-16(5-2-14)21-7-9-25-10-8-21/h1-6,11,22-23H,7-10,12-13H2,(H,20,24)
n/an/a>1.00E+5n/an/an/an/an/an/a
MRC Technology
Curated by ChEMBL
Assay Description
Inhibition of DNAse1 (unknown origin)
Bioorg Med Chem Lett 25: 4097-103 (2015)
BindingDB Entry DOI: 10.7270/Q2ST7RN9
Flap endonuclease 1
(Homo sapiens (Human))
BDBM50121707
(CHEMBL3617010)
Show SMILES Oc1ccc(CNC(=O)Cc2ccc(cc2)N2CCOCC2)cc1O
Show InChI InChI=1S/C19H22N2O4/c22-17-6-3-15(11-18(17)23)13-20-19(24)12-14-1-4-16(5-2-14)21-7-9-25-10-8-21/h1-6,11,22-23H,7-10,12-13H2,(H,20,24)
Reactome pathway
n/an/a>1.00E+5n/an/an/an/an/an/a
MRC Technology
Curated by ChEMBL
Assay Description
Inhibition of FEN1 (unknown origin)
Bioorg Med Chem Lett 25: 4097-103 (2015)
BindingDB Entry DOI: 10.7270/Q2ST7RN9