BDBM50121718 CHEMBL3617016
SMILES: Oc1cc(F)c(CNC(=O)Cc2ccc(Cl)cc2Cl)cc1O
InChI Key: InChIKey=WVJRXDOWEGCLEP-UHFFFAOYSA-N
Data: 2 IC50
Activity Spreadsheet -- Enzyme Inhibition Constant Data from BindingDB
Found 2 hits for monomerid = 50121718
Trg + Lig
Ki
nM
ΔG°
kcal/mole
IC50
nM
Kd
nM
EC50/IC50
nM
koff
s-1
kon
M-1s-1
pHTemp
°C
Deoxyribonuclease-1
(Homo sapiens (Human))
BDBM50121718
(CHEMBL3617016)
Show SMILES Oc1cc(F)c(CNC(=O)Cc2ccc(Cl)cc2Cl)cc1O
Show InChI InChI=1S/C15H12Cl2FNO3/c16-10-2-1-8(11(17)5-10)4-15(22)19-7-9-3-13(20)14(21)6-12(9)18/h1-3,5-6,20-21H,4,7H2,(H,19,22)
n/an/a>1.00E+5n/an/an/an/an/an/a
MRC Technology
Curated by ChEMBL
Assay Description
Inhibition of DNAse1 (unknown origin)
Bioorg Med Chem Lett 25: 4097-103 (2015)
BindingDB Entry DOI: 10.7270/Q2ST7RN9
Flap endonuclease 1
(Homo sapiens (Human))
BDBM50121718
(CHEMBL3617016)
Show SMILES Oc1cc(F)c(CNC(=O)Cc2ccc(Cl)cc2Cl)cc1O
Show InChI InChI=1S/C15H12Cl2FNO3/c16-10-2-1-8(11(17)5-10)4-15(22)19-7-9-3-13(20)14(21)6-12(9)18/h1-3,5-6,20-21H,4,7H2,(H,19,22)
Reactome pathway
n/an/a>1.00E+5n/an/an/an/an/an/a
MRC Technology
Curated by ChEMBL
Assay Description
Inhibition of FEN1 (unknown origin)
Bioorg Med Chem Lett 25: 4097-103 (2015)
BindingDB Entry DOI: 10.7270/Q2ST7RN9