BDBM50121719 CHEMBL3617017
SMILES: Oc1ccc(CNS(=O)(=O)Cc2ccc(Cl)cc2Cl)cc1O
InChI Key: InChIKey=QZTIBQFCURWXAA-UHFFFAOYSA-N
Data: 2 IC50
Activity Spreadsheet -- Enzyme Inhibition Constant Data from BindingDB
Found 2 hits for monomerid = 50121719
Trg + Lig
Ki
nM
ΔG°
kcal/mole
IC50
nM
Kd
nM
EC50/IC50
nM
koff
s-1
kon
M-1s-1
pHTemp
°C
Deoxyribonuclease-1
(Homo sapiens (Human))
BDBM50121719
(CHEMBL3617017)
Show SMILES Oc1ccc(CNS(=O)(=O)Cc2ccc(Cl)cc2Cl)cc1O
Show InChI InChI=1S/C14H13Cl2NO4S/c15-11-3-2-10(12(16)6-11)8-22(20,21)17-7-9-1-4-13(18)14(19)5-9/h1-6,17-19H,7-8H2
n/an/a>1.00E+5n/an/an/an/an/an/a
MRC Technology
Curated by ChEMBL
Assay Description
Inhibition of DNAse1 (unknown origin)
Bioorg Med Chem Lett 25: 4097-103 (2015)
BindingDB Entry DOI: 10.7270/Q2ST7RN9
Flap endonuclease 1
(Homo sapiens (Human))
BDBM50121719
(CHEMBL3617017)
Show SMILES Oc1ccc(CNS(=O)(=O)Cc2ccc(Cl)cc2Cl)cc1O
Show InChI InChI=1S/C14H13Cl2NO4S/c15-11-3-2-10(12(16)6-11)8-22(20,21)17-7-9-1-4-13(18)14(19)5-9/h1-6,17-19H,7-8H2
Reactome pathway
n/an/a>1.00E+5n/an/an/an/an/an/a
MRC Technology
Curated by ChEMBL
Assay Description
Inhibition of FEN1 (unknown origin)
Bioorg Med Chem Lett 25: 4097-103 (2015)
BindingDB Entry DOI: 10.7270/Q2ST7RN9