BDBM50121725 CHEMBL3617022
SMILES: Oc1ccc(cc1O)-c1nc(Cc2ccc(Cl)cc2)no1
InChI Key: InChIKey=SYZDUPIRDKISOW-UHFFFAOYSA-N
Data: 2 IC50
Activity Spreadsheet -- Enzyme Inhibition Constant Data from BindingDB
Found 2 hits for monomerid = 50121725
Trg + Lig
Ki
nM
ΔG°
kcal/mole
IC50
nM
Kd
nM
EC50/IC50
nM
koff
s-1
kon
M-1s-1
pHTemp
°C
Deoxyribonuclease-1
(Homo sapiens (Human))
BDBM50121725
(CHEMBL3617022)
Show SMILES Oc1ccc(cc1O)-c1nc(Cc2ccc(Cl)cc2)no1
Show InChI InChI=1S/C15H11ClN2O3/c16-11-4-1-9(2-5-11)7-14-17-15(21-18-14)10-3-6-12(19)13(20)8-10/h1-6,8,19-20H,7H2
n/an/a>1.00E+5n/an/an/an/an/an/a
MRC Technology
Curated by ChEMBL
Assay Description
Inhibition of DNAse1 (unknown origin)
Bioorg Med Chem Lett 25: 4097-103 (2015)
BindingDB Entry DOI: 10.7270/Q2ST7RN9
Flap endonuclease 1
(Homo sapiens (Human))
BDBM50121725
(CHEMBL3617022)
Show SMILES Oc1ccc(cc1O)-c1nc(Cc2ccc(Cl)cc2)no1
Show InChI InChI=1S/C15H11ClN2O3/c16-11-4-1-9(2-5-11)7-14-17-15(21-18-14)10-3-6-12(19)13(20)8-10/h1-6,8,19-20H,7H2
Reactome pathway
n/an/a>1.00E+5n/an/an/an/an/an/a
MRC Technology
Curated by ChEMBL
Assay Description
Inhibition of FEN1 (unknown origin)
Bioorg Med Chem Lett 25: 4097-103 (2015)
BindingDB Entry DOI: 10.7270/Q2ST7RN9