BDBM50121910 CHEMBL30969::[(S)-1-((2S,3S)-2-Butoxy-4-oxo-azetidin-3-ylcarbamoyl)-2-phenyl-ethyl]-carbamic acid benzyl ester
SMILES: CCCCO[C@@H]1NC(=O)[C@H]1NC(=O)[C@H](Cc1ccccc1)NC(=O)OCc1ccccc1
InChI Key: InChIKey=GFBNAICZWORTRP-MZKRTTBSSA-N
Data: 5 IC50
Activity Spreadsheet -- Enzyme Inhibition Constant Data from BindingDB
Found 5 hits for monomerid = 50121910
Trg + Lig
Ki
nM
ΔG°
kcal/mole
IC50
nM
Kd
nM
EC50/IC50
nM
koff
s-1
kon
M-1s-1
pHTemp
°C
Cathepsin K
(Homo sapiens (Human))
BDBM50121910
(CHEMBL30969 | [(S)-1-((2S,3S)-2-Butoxy-4-oxo-azeti...)
Show SMILES CCCCO[C@@H]1NC(=O)[C@H]1NC(=O)[C@H](Cc1ccccc1)NC(=O)OCc1ccccc1
Show InChI InChI=1S/C24H29N3O5/c1-2-3-14-31-23-20(22(29)27-23)26-21(28)19(15-17-10-6-4-7-11-17)25-24(30)32-16-18-12-8-5-9-13-18/h4-13,19-20,23H,2-3,14-16H2,1H3,(H,25,30)(H,26,28)(H,27,29)/t19-,20+,23-/m0/s1
Reactome pathway
n/an/a 100n/an/an/an/an/an/a
currently NAEJA Pharmaceutical Inc.
Curated by ChEMBL
Assay Description
Inhibition of recombinant human Cathepsin K
Bioorg Med Chem Lett 13: 139-41 (2002)
BindingDB Entry DOI: 10.7270/Q27W6BJB
Cathepsin B
(Rattus norvegicus)
BDBM50121910
(CHEMBL30969 | [(S)-1-((2S,3S)-2-Butoxy-4-oxo-azeti...)
Show SMILES CCCCO[C@@H]1NC(=O)[C@H]1NC(=O)[C@H](Cc1ccccc1)NC(=O)OCc1ccccc1
Show InChI InChI=1S/C24H29N3O5/c1-2-3-14-31-23-20(22(29)27-23)26-21(28)19(15-17-10-6-4-7-11-17)25-24(30)32-16-18-12-8-5-9-13-18/h4-13,19-20,23H,2-3,14-16H2,1H3,(H,25,30)(H,26,28)(H,27,29)/t19-,20+,23-/m0/s1
n/an/a 7.01E+3n/an/an/an/an/an/a
currently NAEJA Pharmaceutical Inc.
Curated by ChEMBL
Assay Description
Inhibition of recombinant rat Cathepsin B
Bioorg Med Chem Lett 13: 139-41 (2002)
BindingDB Entry DOI: 10.7270/Q27W6BJB
Procathepsin L
(Homo sapiens (Human))
BDBM50121910
(CHEMBL30969 | [(S)-1-((2S,3S)-2-Butoxy-4-oxo-azeti...)
Show SMILES CCCCO[C@@H]1NC(=O)[C@H]1NC(=O)[C@H](Cc1ccccc1)NC(=O)OCc1ccccc1
Show InChI InChI=1S/C24H29N3O5/c1-2-3-14-31-23-20(22(29)27-23)26-21(28)19(15-17-10-6-4-7-11-17)25-24(30)32-16-18-12-8-5-9-13-18/h4-13,19-20,23H,2-3,14-16H2,1H3,(H,25,30)(H,26,28)(H,27,29)/t19-,20+,23-/m0/s1
Reactome pathway
n/an/a 163n/an/an/an/an/an/a
currently NAEJA Pharmaceutical Inc.
Curated by ChEMBL
Assay Description
Inhibition of recombinant human Cathepsin L
Bioorg Med Chem Lett 13: 139-41 (2002)
BindingDB Entry DOI: 10.7270/Q27W6BJB
Leukocyte elastase
(Homo sapiens (Human))
BDBM50121910
(CHEMBL30969 | [(S)-1-((2S,3S)-2-Butoxy-4-oxo-azeti...)
Show SMILES CCCCO[C@@H]1NC(=O)[C@H]1NC(=O)[C@H](Cc1ccccc1)NC(=O)OCc1ccccc1
Show InChI InChI=1S/C24H29N3O5/c1-2-3-14-31-23-20(22(29)27-23)26-21(28)19(15-17-10-6-4-7-11-17)25-24(30)32-16-18-12-8-5-9-13-18/h4-13,19-20,23H,2-3,14-16H2,1H3,(H,25,30)(H,26,28)(H,27,29)/t19-,20+,23-/m0/s1
Reactome pathway
n/an/a>5.00E+4n/an/an/an/an/an/a
currently NAEJA Pharmaceutical Inc.
Curated by ChEMBL
Assay Description
Inhibition of human leukocyte elastase(HLE)
Bioorg Med Chem Lett 13: 139-41 (2002)
BindingDB Entry DOI: 10.7270/Q27W6BJB
Cathepsin S
(Homo sapiens (Human))
BDBM50121910
(CHEMBL30969 | [(S)-1-((2S,3S)-2-Butoxy-4-oxo-azeti...)
Show SMILES CCCCO[C@@H]1NC(=O)[C@H]1NC(=O)[C@H](Cc1ccccc1)NC(=O)OCc1ccccc1
Show InChI InChI=1S/C24H29N3O5/c1-2-3-14-31-23-20(22(29)27-23)26-21(28)19(15-17-10-6-4-7-11-17)25-24(30)32-16-18-12-8-5-9-13-18/h4-13,19-20,23H,2-3,14-16H2,1H3,(H,25,30)(H,26,28)(H,27,29)/t19-,20+,23-/m0/s1
Reactome pathway
n/an/a 355n/an/an/an/an/an/a
currently NAEJA Pharmaceutical Inc.
Curated by ChEMBL
Assay Description
Inhibition of recombinant human cathepsin S
Bioorg Med Chem Lett 13: 139-41 (2002)
BindingDB Entry DOI: 10.7270/Q27W6BJB