null
SMILES: Nc1ccnc(c1)C(O)=O
InChI Key: InChIKey=JRZBTJVSAANBEV-UHFFFAOYSA-N
Activity Spreadsheet -- Enzyme Inhibition Constant Data from BindingDB
Found 2 hits for monomerid = 50121996
Trg + Lig
Ki
nM
ΔG°
kcal/mole
IC50
nM
Kd
nM
EC50/IC50
nM
koff
s-1
kon
M-1s-1
pHTemp
°C
D-aspartate oxidase
(Homo sapiens (Human))
BDBM50121996
(CHEMBL3617326)
Show SMILES Nc1ccnc(c1)C(O)=O
Show InChI InChI=1S/C6H6N2O2/c7-4-1-2-8-5(3-4)6(9)10/h1-3H,(H2,7,8)(H,9,10)
n/an/a>1.00E+5n/an/an/an/an/an/a
Kitasato University
Curated by ChEMBL
Assay Description
Inhibition of human recombinant DDO expressed in Escherichia coli BL21(DE3) using D-Asp and D-Ala assessed as 2-oxo acid production after 10 mins by ...
J Med Chem 58: 7328-40 (2015)
Article DOI: 10.1021/acs.jmedchem.5b00871
BindingDB Entry DOI: 10.7270/Q2WM1G6R
D-amino-acid oxidase
(Homo sapiens (Human))
BDBM50121996
(CHEMBL3617326)
Show SMILES Nc1ccnc(c1)C(O)=O
Show InChI InChI=1S/C6H6N2O2/c7-4-1-2-8-5(3-4)6(9)10/h1-3H,(H2,7,8)(H,9,10)
Reactome pathway
n/an/a>1.00E+5n/an/an/an/an/an/a
Kitasato University
Curated by ChEMBL
Assay Description
Inhibition of human recombinant DAO expressed in Escherichia coli BL21(DE3) using D-Asp and D-Ala assessed as 2-oxo acid production after 10 mins by ...
J Med Chem 58: 7328-40 (2015)
Article DOI: 10.1021/acs.jmedchem.5b00871
BindingDB Entry DOI: 10.7270/Q2WM1G6R