null
SMILES: Oc1ccc(cc1C#N)C(=O)NN=Cc1ccc(N(C(=O)C2CCCC2)C(=O)C2CCCC2)c2ccccc12
InChI Key: InChIKey=BHMNOLWSFZMLPS-UHFFFAOYSA-N
Activity Spreadsheet -- Enzyme Inhibition Constant Data from BindingDB
Found 1 hit for monomerid = 50122159
Trg + Lig
Ki
nM
ΔG°
kcal/mole
IC50
nM
Kd
nM
EC50/IC50
nM
koff
s-1
kon
M-1s-1
pHTemp
°C
Glucagon receptor
(Homo sapiens (Human))
BDBM50122159
(CHEMBL152477 | Cyclopentanecarboxylic acid {4-[(3-...)
Show SMILES Oc1ccc(cc1C#N)C(=O)NN=Cc1ccc(N(C(=O)C2CCCC2)C(=O)C2CCCC2)c2ccccc12 |w:12.12|
Show InChI InChI=1S/C31H30N4O4/c32-18-24-17-22(14-16-28(24)36)29(37)34-33-19-23-13-15-27(26-12-6-5-11-25(23)26)35(30(38)20-7-1-2-8-20)31(39)21-9-3-4-10-21/h5-6,11-17,19-21,36H,1-4,7-10H2,(H,34,37)
n/an/a 2.80n/an/an/an/an/an/a
Novo Nordisk A/S
Curated by ChEMBL
Assay Description
In vitro binding affinity for recombinant human glucagon receptor (hGGR) in BHK cells
J Med Chem 45: 5755-75 (2002)
BindingDB Entry DOI: 10.7270/Q26W99FD