null
SMILES: C[C@@H]1CN(C(=O)c2cc(COc3ccc(Cl)cn3)nn12)c1c(F)cccc1F
InChI Key: InChIKey=CYHGCAMRFRTVNB-LLVKDONJSA-N
Activity Spreadsheet -- Enzyme Inhibition Constant Data from BindingDB
Found 4 hits for monomerid = 50122246
Trg + Lig
Ki
nM
ΔG°
kcal/mole
IC50
nM
Kd
nM
EC50/IC50
nM
koff
s-1
kon
M-1s-1
pHTemp
°C
Metabotropic glutamate receptor 3
(Rattus norvegicus (Rat))
BDBM50122246
(CHEMBL3617646)
Show SMILES C[C@@H]1CN(C(=O)c2cc(COc3ccc(Cl)cn3)nn12)c1c(F)cccc1F |r|
Show InChI InChI=1S/C19H15ClF2N4O2/c1-11-9-25(18-14(21)3-2-4-15(18)22)19(27)16-7-13(24-26(11)16)10-28-17-6-5-12(20)8-23-17/h2-8,11H,9-10H2,1H3/t11-/m1/s1
n/an/a 224n/an/an/an/an/an/a
Vanderbilt University Medical Center
Curated by ChEMBL
Assay Description
Negative allosteric modulation of rat mGlu3 receptor assessed as calcium mobilization by cell based fluorescence assay
J Med Chem 58: 7485-500 (2015)
BindingDB Entry DOI: 10.7270/Q2H9970P
Metabotropic glutamate receptor 5
(Rattus norvegicus (Rat))
BDBM50122246
(CHEMBL3617646)
Show SMILES C[C@@H]1CN(C(=O)c2cc(COc3ccc(Cl)cn3)nn12)c1c(F)cccc1F |r|
Show InChI InChI=1S/C19H15ClF2N4O2/c1-11-9-25(18-14(21)3-2-4-15(18)22)19(27)16-7-13(24-26(11)16)10-28-17-6-5-12(20)8-23-17/h2-8,11H,9-10H2,1H3/t11-/m1/s1
Reactome pathway
n/an/an/an/a 1.41E+3n/an/an/an/a
Vanderbilt University Medical Center
Curated by ChEMBL
Assay Description
Modulation of rat mGlu5 receptor assessed as calcium mobilization by cell based fluorescence assay
J Med Chem 58: 7485-500 (2015)
BindingDB Entry DOI: 10.7270/Q2H9970P
Metabotropic glutamate receptor 5
(Rattus norvegicus (Rat))
BDBM50122246
(CHEMBL3617646)
Show SMILES C[C@@H]1CN(C(=O)c2cc(COc3ccc(Cl)cn3)nn12)c1c(F)cccc1F |r|
Show InChI InChI=1S/C19H15ClF2N4O2/c1-11-9-25(18-14(21)3-2-4-15(18)22)19(27)16-7-13(24-26(11)16)10-28-17-6-5-12(20)8-23-17/h2-8,11H,9-10H2,1H3/t11-/m1/s1
Reactome pathway
n/an/an/an/a 1.42E+3n/an/an/an/a
Vanderbilt University Medical Center
Curated by ChEMBL
Assay Description
Modulation of rat mGlu5 receptor assessed as calcium mobilization by cell based fluorescence assay
J Med Chem 58: 7485-500 (2015)
BindingDB Entry DOI: 10.7270/Q2H9970P
Metabotropic glutamate receptor 3
(Rattus norvegicus (Rat))
BDBM50122246
(CHEMBL3617646)
Show SMILES C[C@@H]1CN(C(=O)c2cc(COc3ccc(Cl)cn3)nn12)c1c(F)cccc1F |r|
Show InChI InChI=1S/C19H15ClF2N4O2/c1-11-9-25(18-14(21)3-2-4-15(18)22)19(27)16-7-13(24-26(11)16)10-28-17-6-5-12(20)8-23-17/h2-8,11H,9-10H2,1H3/t11-/m1/s1
n/an/a 225n/an/an/an/an/an/a
Vanderbilt University Medical Center
Curated by ChEMBL
Assay Description
Negative allosteric modulation of rat mGlu3 receptor assessed as calcium mobilization by cell based fluorescence assay
J Med Chem 58: 7485-500 (2015)
BindingDB Entry DOI: 10.7270/Q2H9970P