null
SMILES: COc1cccc(c1)N1C[C@@H](C)n2nc(COc3ccc(F)cn3)cc2C1=O
InChI Key: InChIKey=PBCPLVFHKQAVKE-CYBMUJFWSA-N
Activity Spreadsheet -- Enzyme Inhibition Constant Data from BindingDB
Found 4 hits for monomerid = 50122271
Trg + Lig
Ki
nM
ΔG°
kcal/mole
IC50
nM
Kd
nM
EC50/IC50
nM
koff
s-1
kon
M-1s-1
pHTemp
°C
Metabotropic glutamate receptor 3
(Rattus norvegicus (Rat))
BDBM50122271
(CHEMBL3617621)
Show SMILES COc1cccc(c1)N1C[C@@H](C)n2nc(COc3ccc(F)cn3)cc2C1=O |r|
Show InChI InChI=1S/C20H19FN4O3/c1-13-11-24(16-4-3-5-17(9-16)27-2)20(26)18-8-15(23-25(13)18)12-28-19-7-6-14(21)10-22-19/h3-10,13H,11-12H2,1-2H3/t13-/m1/s1
n/an/a 200n/an/an/an/an/an/a
Vanderbilt University Medical Center
Curated by ChEMBL
Assay Description
Negative allosteric modulation of rat mGlu3 receptor assessed as calcium mobilization by cell based fluorescence assay
J Med Chem 58: 7485-500 (2015)
BindingDB Entry DOI: 10.7270/Q2H9970P
Metabotropic glutamate receptor 5
(Rattus norvegicus (Rat))
BDBM50122271
(CHEMBL3617621)
Show SMILES COc1cccc(c1)N1C[C@@H](C)n2nc(COc3ccc(F)cn3)cc2C1=O |r|
Show InChI InChI=1S/C20H19FN4O3/c1-13-11-24(16-4-3-5-17(9-16)27-2)20(26)18-8-15(23-25(13)18)12-28-19-7-6-14(21)10-22-19/h3-10,13H,11-12H2,1-2H3/t13-/m1/s1
Reactome pathway
n/an/an/an/a>1.00E+4n/an/an/an/a
Vanderbilt University Medical Center
Curated by ChEMBL
Assay Description
Modulation of rat mGlu5 receptor assessed as calcium mobilization by cell based fluorescence assay
J Med Chem 58: 7485-500 (2015)
BindingDB Entry DOI: 10.7270/Q2H9970P
Metabotropic glutamate receptor 3
(Rattus norvegicus (Rat))
BDBM50122271
(CHEMBL3617621)
Show SMILES COc1cccc(c1)N1C[C@@H](C)n2nc(COc3ccc(F)cn3)cc2C1=O |r|
Show InChI InChI=1S/C20H19FN4O3/c1-13-11-24(16-4-3-5-17(9-16)27-2)20(26)18-8-15(23-25(13)18)12-28-19-7-6-14(21)10-22-19/h3-10,13H,11-12H2,1-2H3/t13-/m1/s1
n/an/a 198n/an/an/an/an/an/a
Vanderbilt University Medical Center
Curated by ChEMBL
Assay Description
Negative allosteric modulation of rat mGlu3 receptor assessed as calcium mobilization by cell based fluorescence assay
J Med Chem 58: 7485-500 (2015)
BindingDB Entry DOI: 10.7270/Q2H9970P
Metabotropic glutamate receptor 5
(Rattus norvegicus (Rat))
BDBM50122271
(CHEMBL3617621)
Show SMILES COc1cccc(c1)N1C[C@@H](C)n2nc(COc3ccc(F)cn3)cc2C1=O |r|
Show InChI InChI=1S/C20H19FN4O3/c1-13-11-24(16-4-3-5-17(9-16)27-2)20(26)18-8-15(23-25(13)18)12-28-19-7-6-14(21)10-22-19/h3-10,13H,11-12H2,1-2H3/t13-/m1/s1
Reactome pathway
n/an/an/an/a<1.00E+4n/an/an/an/a
Vanderbilt University Medical Center
Curated by ChEMBL
Assay Description
Modulation of rat mGlu5 receptor assessed as calcium mobilization by cell based fluorescence assay
J Med Chem 58: 7485-500 (2015)
BindingDB Entry DOI: 10.7270/Q2H9970P