BDBM50122376 5-(2-Chloro-4-fluoro-phenyl)-7-(1-cyclobutylmethyl-piperidin-4-yl)-1-(2,6-dichloro-phenyl)-3,4-dihydro-1H-quinazolin-2-one::5-(2-chloro-4-fluorophenyl)-7-(1-(cyclobutylmethyl)piperidin-4-yl)-1-(2,6-dichlorophenyl)-3,4-dihydroquinazolin-2(1H)-one::CHEMBL264627
SMILES: Fc1ccc(c(Cl)c1)-c1cc(cc2N(C(=O)NCc12)c1c(Cl)cccc1Cl)C1CCN(CC2CCC2)CC1
InChI Key: InChIKey=VATQLKILEGFOAH-UHFFFAOYSA-N
Data: 2 IC50
Activity Spreadsheet -- Enzyme Inhibition Constant Data from BindingDB
Found 2 hits for monomerid = 50122376
Trg + Lig
Ki
nM
ΔG°
kcal/mole
IC50
nM
Kd
nM
EC50/IC50
nM
koff
s-1
kon
M-1s-1
pHTemp
°C
Mitogen-activated protein kinase 14
(Homo sapiens (Human))
BDBM50122376
(5-(2-Chloro-4-fluoro-phenyl)-7-(1-cyclobutylmethyl...)
Show SMILES Fc1ccc(c(Cl)c1)-c1cc(cc2N(C(=O)NCc12)c1c(Cl)cccc1Cl)C1CCN(CC2CCC2)CC1
Show InChI InChI=1S/C30H29Cl3FN3O/c31-25-5-2-6-26(32)29(25)37-28-14-20(19-9-11-36(12-10-19)17-18-3-1-4-18)13-23(24(28)16-35-30(37)38)22-8-7-21(34)15-27(22)33/h2,5-8,13-15,18-19H,1,3-4,9-12,16-17H2,(H,35,38)
NCI pathway
Reactome pathway
n/an/a 0.600n/an/an/an/an/an/a
TBA
Assay Description
Inhibition of p38alpha MAPK (unknown origin)
Citation and Details
Article DOI: 10.1007/s00044-012-0179-7
BindingDB Entry DOI: 10.7270/Q2WW7MMT
Mitogen-activated protein kinase 14
(Homo sapiens (Human))
BDBM50122376
(5-(2-Chloro-4-fluoro-phenyl)-7-(1-cyclobutylmethyl...)
Show SMILES Fc1ccc(c(Cl)c1)-c1cc(cc2N(C(=O)NCc12)c1c(Cl)cccc1Cl)C1CCN(CC2CCC2)CC1
Show InChI InChI=1S/C30H29Cl3FN3O/c31-25-5-2-6-26(32)29(25)37-28-14-20(19-9-11-36(12-10-19)17-18-3-1-4-18)13-23(24(28)16-35-30(37)38)22-8-7-21(34)15-27(22)33/h2,5-8,13-15,18-19H,1,3-4,9-12,16-17H2,(H,35,38)
NCI pathway
Reactome pathway
n/an/a 0.600n/an/an/an/an/an/a
Merck Research Laboratories
Curated by ChEMBL
Assay Description
Inhibitory activity against mitogen-activated protein kinase p38 alpha
Bioorg Med Chem Lett 13: 277-80 (2002)
BindingDB Entry DOI: 10.7270/Q25X2884