BDBM50122395 5-(2-Chloro-4-fluoro-phenyl)-7-(1-cyclopropylmethyl-piperidin-4-yl)-1-(2,6-dichloro-phenyl)-3,4-dihydro-1H-quinazolin-2-one::5-(2-chloro-4-fluorophenyl)-7-(1-(cyclopropylmethyl)piperidin-4-yl)-1-(2,6-dichlorophenyl)-3,4-dihydroquinazolin-2(1H)-one::CHEMBL419134
SMILES: Fc1ccc(c(Cl)c1)-c1cc(cc2N(C(=O)NCc12)c1c(Cl)cccc1Cl)C1CCN(CC2CC2)CC1
InChI Key: InChIKey=MVPOVMMXSWJYCF-UHFFFAOYSA-N
Data: 2 IC50
Activity Spreadsheet -- Enzyme Inhibition Constant Data from BindingDB
Found 2 hits for monomerid = 50122395
Trg + Lig
Ki
nM
ΔG°
kcal/mole
IC50
nM
Kd
nM
EC50/IC50
nM
koff
s-1
kon
M-1s-1
pHTemp
°C
Mitogen-activated protein kinase 14
(Homo sapiens (Human))
BDBM50122395
(5-(2-Chloro-4-fluoro-phenyl)-7-(1-cyclopropylmethy...)
Show SMILES Fc1ccc(c(Cl)c1)-c1cc(cc2N(C(=O)NCc12)c1c(Cl)cccc1Cl)C1CCN(CC2CC2)CC1
Show InChI InChI=1S/C29H27Cl3FN3O/c30-24-2-1-3-25(31)28(24)36-27-13-19(18-8-10-35(11-9-18)16-17-4-5-17)12-22(23(27)15-34-29(36)37)21-7-6-20(33)14-26(21)32/h1-3,6-7,12-14,17-18H,4-5,8-11,15-16H2,(H,34,37)
NCI pathway
Reactome pathway
n/an/a 0.500n/an/an/an/an/an/a
TBA
Assay Description
Inhibition of p38alpha MAPK (unknown origin)
Citation and Details
Article DOI: 10.1007/s00044-012-0179-7
BindingDB Entry DOI: 10.7270/Q2WW7MMT
Mitogen-activated protein kinase 14
(Homo sapiens (Human))
BDBM50122395
(5-(2-Chloro-4-fluoro-phenyl)-7-(1-cyclopropylmethy...)
Show SMILES Fc1ccc(c(Cl)c1)-c1cc(cc2N(C(=O)NCc12)c1c(Cl)cccc1Cl)C1CCN(CC2CC2)CC1
Show InChI InChI=1S/C29H27Cl3FN3O/c30-24-2-1-3-25(31)28(24)36-27-13-19(18-8-10-35(11-9-18)16-17-4-5-17)12-22(23(27)15-34-29(36)37)21-7-6-20(33)14-26(21)32/h1-3,6-7,12-14,17-18H,4-5,8-11,15-16H2,(H,34,37)
NCI pathway
Reactome pathway
n/an/a 0.5n/an/an/an/an/an/a
Merck Research Laboratories
Curated by ChEMBL
Assay Description
Inhibitory activity against mitogen-activated protein kinase p38 alpha
Bioorg Med Chem Lett 13: 277-80 (2002)
BindingDB Entry DOI: 10.7270/Q25X2884