BDBM50122401 5-(2-Chloro-phenyl)-1-(2,6-dichloro-phenyl)-7-(piperazine-1-carbonyl)-3,4-dihydro-1H-quinazolin-2-one::5-(2-chlorophenyl)-1-(2,6-dichlorophenyl)-7-(piperazine-1-carbonyl)-3,4-dihydroquinazolin-2(1H)-one::CHEMBL94444
SMILES: Clc1ccccc1-c1cc(cc2N(C(=O)NCc12)c1c(Cl)cccc1Cl)C(=O)N1CCNCC1
InChI Key: InChIKey=JUXDLXJBIWNUOW-UHFFFAOYSA-N
Data: 3 IC50
Activity Spreadsheet -- Enzyme Inhibition Constant Data from BindingDB
Found 3 hits for monomerid = 50122401
Trg + Lig
Ki
nM
ΔG°
kcal/mole
IC50
nM
Kd
nM
EC50/IC50
nM
koff
s-1
kon
M-1s-1
pHTemp
°C
Mitogen-activated protein kinase 14
(Homo sapiens (Human))
BDBM50122401
(5-(2-Chloro-phenyl)-1-(2,6-dichloro-phenyl)-7-(pip...)
Show SMILES Clc1ccccc1-c1cc(cc2N(C(=O)NCc12)c1c(Cl)cccc1Cl)C(=O)N1CCNCC1
Show InChI InChI=1S/C25H21Cl3N4O2/c26-19-5-2-1-4-16(19)17-12-15(24(33)31-10-8-29-9-11-31)13-22-18(17)14-30-25(34)32(22)23-20(27)6-3-7-21(23)28/h1-7,12-13,29H,8-11,14H2,(H,30,34)
NCI pathway
Reactome pathway
n/an/a 1.5n/an/an/an/an/an/a
Merck Research Laboratories
Curated by ChEMBL
Assay Description
Inhibitory activity against mitogen-activated protein kinase p38 alpha
Bioorg Med Chem Lett 13: 277-80 (2002)
BindingDB Entry DOI: 10.7270/Q25X2884
Mitogen-activated protein kinase 14
(Homo sapiens (Human))
BDBM50122401
(5-(2-Chloro-phenyl)-1-(2,6-dichloro-phenyl)-7-(pip...)
Show SMILES Clc1ccccc1-c1cc(cc2N(C(=O)NCc12)c1c(Cl)cccc1Cl)C(=O)N1CCNCC1
Show InChI InChI=1S/C25H21Cl3N4O2/c26-19-5-2-1-4-16(19)17-12-15(24(33)31-10-8-29-9-11-31)13-22-18(17)14-30-25(34)32(22)23-20(27)6-3-7-21(23)28/h1-7,12-13,29H,8-11,14H2,(H,30,34)
NCI pathway
Reactome pathway
n/an/a 1.5n/an/an/an/an/an/a
TBA
Assay Description
Inhibition of p38alpha MAPK (unknown origin)
Citation and Details
Article DOI: 10.1007/s00044-012-0179-7
BindingDB Entry DOI: 10.7270/Q2WW7MMT
Mitogen-activated protein kinase 14
(Homo sapiens (Human))
BDBM50122401
(5-(2-Chloro-phenyl)-1-(2,6-dichloro-phenyl)-7-(pip...)
Show SMILES Clc1ccccc1-c1cc(cc2N(C(=O)NCc12)c1c(Cl)cccc1Cl)C(=O)N1CCNCC1
Show InChI InChI=1S/C25H21Cl3N4O2/c26-19-5-2-1-4-16(19)17-12-15(24(33)31-10-8-29-9-11-31)13-22-18(17)14-30-25(34)32(22)23-20(27)6-3-7-21(23)28/h1-7,12-13,29H,8-11,14H2,(H,30,34)
NCI pathway
Reactome pathway
n/an/a 1.5n/an/an/an/an/an/a
University of Zurich
Curated by ChEMBL
Assay Description
Inhibition of p38alpha
J Med Chem 51: 1179-88 (2008)
Article DOI: 10.1021/jm070654j
BindingDB Entry DOI: 10.7270/Q29Z95RD