BDBM50122453 CHEMBL3622491
SMILES: CCN(C(=O)c1ccc(CNc2nc(NCCN3CCN(C)CC3)nc(n2)N2CCc3ccccc3C2)cc1)c1cccc(C)c1
InChI Key: InChIKey=GYJBRTKAEHLDQW-UHFFFAOYSA-N
Data: 1 IC50
Activity Spreadsheet -- Enzyme Inhibition Constant Data from BindingDB
Found 1 hit for monomerid = 50122453
Trg + Lig
Ki
nM
ΔG°
kcal/mole
IC50
nM
Kd
nM
EC50/IC50
nM
koff
s-1
kon
M-1s-1
pHTemp
°C
A disintegrin and metalloproteinase with thrombospondin motifs 4 (ADAMTS-4)
(Homo sapiens (Human))
BDBM50122453
(CHEMBL3622491)
Show SMILES CCN(C(=O)c1ccc(CNc2nc(NCCN3CCN(C)CC3)nc(n2)N2CCc3ccccc3C2)cc1)c1cccc(C)c1
Show InChI InChI=1S/C36H45N9O/c1-4-45(32-11-7-8-27(2)24-32)33(46)30-14-12-28(13-15-30)25-38-35-39-34(37-17-19-43-22-20-42(3)21-23-43)40-36(41-35)44-18-16-29-9-5-6-10-31(29)26-44/h5-15,24H,4,16-23,25-26H2,1-3H3,(H2,37,38,39,40,41)
Reactome pathway
n/an/a 6n/an/an/an/an/an/a
GlaxoSmithKline
Curated by ChEMBL
Assay Description
Inhibition of recombinant human ADAMTS4 (213 to 575 amino acid residues) using WAAG-3R as substrate preincubated for 15 mins followed by substrate ad...
ACS Med Chem Lett 6: 888-93 (2015)
BindingDB Entry DOI: 10.7270/Q2416ZWQ