BDBM50122484 CHEMBL3622484
SMILES: CCN(C(=O)c1ccc(CNc2nc(NCCN(C)C)nc(n2)N2CCc3cc(OC)c(OC)cc3C2)cc1)c1cccc(C)c1
InChI Key: InChIKey=UEYOQAFAZYHFFH-UHFFFAOYSA-N
Data: 1 IC50
Activity Spreadsheet -- Enzyme Inhibition Constant Data from BindingDB
Found 1 hit for monomerid = 50122484
Trg + Lig
Ki
nM
ΔG°
kcal/mole
IC50
nM
Kd
nM
EC50/IC50
nM
koff
s-1
kon
M-1s-1
pHTemp
°C
A disintegrin and metalloproteinase with thrombospondin motifs 4 (ADAMTS-4)
(Homo sapiens (Human))
BDBM50122484
(CHEMBL3622484)
Show SMILES CCN(C(=O)c1ccc(CNc2nc(NCCN(C)C)nc(n2)N2CCc3cc(OC)c(OC)cc3C2)cc1)c1cccc(C)c1
Show InChI InChI=1S/C35H44N8O3/c1-7-43(29-10-8-9-24(2)19-29)32(44)26-13-11-25(12-14-26)22-37-34-38-33(36-16-18-41(3)4)39-35(40-34)42-17-15-27-20-30(45-5)31(46-6)21-28(27)23-42/h8-14,19-21H,7,15-18,22-23H2,1-6H3,(H2,36,37,38,39,40)
Reactome pathway
n/an/a 14n/an/an/an/an/an/a
GlaxoSmithKline
Curated by ChEMBL
Assay Description
Inhibition of recombinant human ADAMTS4 (213 to 575 amino acid residues) using WAAG-3R as substrate preincubated for 15 mins followed by substrate ad...
ACS Med Chem Lett 6: 888-93 (2015)
BindingDB Entry DOI: 10.7270/Q2416ZWQ