BDBM50122525 CHEMBL3622503
SMILES: CCN(C)C(=O)c1ccc(CNc2nc(NCCN3CCN(C)CC3)nc(n2)N2CCc3cc(OC)c(OC)cc3C2)cc1
InChI Key: InChIKey=QRTSVJFTKXAQHR-UHFFFAOYSA-N
Data: 1 IC50
Activity Spreadsheet -- Enzyme Inhibition Constant Data from BindingDB
Found 1 hit for monomerid = 50122525
Trg + Lig
Ki
nM
ΔG°
kcal/mole
IC50
nM
Kd
nM
EC50/IC50
nM
koff
s-1
kon
M-1s-1
pHTemp
°C
A disintegrin and metalloproteinase with thrombospondin motifs 4 (ADAMTS-4)
(Homo sapiens (Human))
BDBM50122525
(CHEMBL3622503)
Show SMILES CCN(C)C(=O)c1ccc(CNc2nc(NCCN3CCN(C)CC3)nc(n2)N2CCc3cc(OC)c(OC)cc3C2)cc1
Show InChI InChI=1S/C32H45N9O3/c1-6-39(3)29(42)24-9-7-23(8-10-24)21-34-31-35-30(33-12-14-40-17-15-38(2)16-18-40)36-32(37-31)41-13-11-25-19-27(43-4)28(44-5)20-26(25)22-41/h7-10,19-20H,6,11-18,21-22H2,1-5H3,(H2,33,34,35,36,37)
Reactome pathway
n/an/a 64n/an/an/an/an/an/a
GlaxoSmithKline
Curated by ChEMBL
Assay Description
Inhibition of recombinant human ADAMTS4 (213 to 575 amino acid residues) using WAAG-3R as substrate preincubated for 15 mins followed by substrate ad...
ACS Med Chem Lett 6: 888-93 (2015)
BindingDB Entry DOI: 10.7270/Q2416ZWQ