BDBM50122527 16,17-dimethyl-(16S)-17-azatetracyclo[7.6.2.02,7.010,15]heptadeca-2(7),3,5,12,14-pentaene::CHEMBL344301
SMILES: C[C@H]1C2C3=CC=CC[C@@H]3[C@@H](Cc3ccccc23)N1C
InChI Key: InChIKey=NHBOGHQFCGGGEW-QSMOKTFHSA-N
Data: 3 IC50
Activity Spreadsheet -- Enzyme Inhibition Constant Data from BindingDB
Found 3 hits for monomerid = 50122527
Trg + Lig
Ki
nM
ΔG°
kcal/mole
IC50
nM
Kd
nM
EC50/IC50
nM
koff
s-1
kon
M-1s-1
pHTemp
°C
Delta-type opioid receptor
(Homo sapiens (Human))
BDBM50122527
(16,17-dimethyl-(16S)-17-azatetracyclo[7.6.2.02,7.0...)
Show SMILES C[C@H]1C2C3=CC=CC[C@@H]3[C@@H](Cc3ccccc23)N1C |c:5,t:3,TLB:18:17:3.8:16.10.11,0:1:3.8:16.10.11|
Show InChI InChI=1S/C18H21N/c1-12-18-14-8-4-3-7-13(14)11-17(19(12)2)15-9-5-6-10-16(15)18/h3-8,10,12,15,17-18H,9,11H2,1-2H3/t12-,15?,17+,18?/m0/s1
Reactome pathway
n/an/a>1.00E+4n/an/an/an/an/an/a
Universit£ de Montr£al
Curated by ChEMBL
Assay Description
In vitro binding affinity against cloned human Opioid receptor delta 1 expressed in HEK 293S cells
J Med Chem 46: 34-48 (2002)
Article DOI: 10.1021/jm020164l
BindingDB Entry DOI: 10.7270/Q2TM7BTT
Mu-type opioid receptor
(Homo sapiens (Human))
BDBM50122527
(16,17-dimethyl-(16S)-17-azatetracyclo[7.6.2.02,7.0...)
Show SMILES C[C@H]1C2C3=CC=CC[C@@H]3[C@@H](Cc3ccccc23)N1C |c:5,t:3,TLB:18:17:3.8:16.10.11,0:1:3.8:16.10.11|
Show InChI InChI=1S/C18H21N/c1-12-18-14-8-4-3-7-13(14)11-17(19(12)2)15-9-5-6-10-16(15)18/h3-8,10,12,15,17-18H,9,11H2,1-2H3/t12-,15?,17+,18?/m0/s1
NCI pathway
Reactome pathway
n/an/a 230n/an/an/an/an/an/a
Universit£ de Montr£al
Curated by ChEMBL
Assay Description
Tested for effective concentration against cloned human Opioid receptor mu 1
J Med Chem 46: 34-48 (2002)
Article DOI: 10.1021/jm020164l
BindingDB Entry DOI: 10.7270/Q2TM7BTT
Kappa-type opioid receptor
(Homo sapiens (Human))
BDBM50122527
(16,17-dimethyl-(16S)-17-azatetracyclo[7.6.2.02,7.0...)
Show SMILES C[C@H]1C2C3=CC=CC[C@@H]3[C@@H](Cc3ccccc23)N1C |c:5,t:3,TLB:18:17:3.8:16.10.11,0:1:3.8:16.10.11|
Show InChI InChI=1S/C18H21N/c1-12-18-14-8-4-3-7-13(14)11-17(19(12)2)15-9-5-6-10-16(15)18/h3-8,10,12,15,17-18H,9,11H2,1-2H3/t12-,15?,17+,18?/m0/s1
Reactome pathway
n/an/a>7.50E+4n/an/an/an/an/an/a
Universit£ de Montr£al
Curated by ChEMBL
Assay Description
In vitro binding affinity against cloned human Opioid receptor kappa 1 expressed in HEK 293S cells
J Med Chem 46: 34-48 (2002)
Article DOI: 10.1021/jm020164l
BindingDB Entry DOI: 10.7270/Q2TM7BTT