BDBM50122576 (E)-4-Morpholin-4-yl-but-2-enoic acid [4-(3-bromo-phenylamino)-3-cyano-7-methoxy-quinolin-6-yl]-amide::4-Morpholin-4-yl-but-2-enoic acid [4-(3-bromo-phenylamino)-3-cyano-7-methoxy-quinolin-6-yl]-amide::CHEMBL332497
SMILES: COc1cc2ncc(C#N)c(Nc3cccc(Br)c3)c2cc1NC(=O)\C=C\CN1CCOCC1
InChI Key: InChIKey=XXOLFZCJKCTSFL-ZZXKWVIFSA-N
Data: 5 IC50
Activity Spreadsheet -- Enzyme Inhibition Constant Data from BindingDB
Found 5 hits for monomerid = 50122576
Trg + Lig
Ki
nM
ΔG°
kcal/mole
IC50
nM
Kd
nM
EC50/IC50
nM
koff
s-1
kon
M-1s-1
pHTemp
°C
Epidermal growth factor receptor
(Homo sapiens (Human))
BDBM50122576
((E)-4-Morpholin-4-yl-but-2-enoic acid [4-(3-bromo-...)
Show SMILES COc1cc2ncc(C#N)c(Nc3cccc(Br)c3)c2cc1NC(=O)\C=C\CN1CCOCC1
Show InChI InChI=1S/C25H24BrN5O3/c1-33-23-14-21-20(13-22(23)30-24(32)6-3-7-31-8-10-34-11-9-31)25(17(15-27)16-28-21)29-19-5-2-4-18(26)12-19/h2-6,12-14,16H,7-11H2,1H3,(H,28,29)(H,30,32)/b6-3+
n/an/a 3.83E+3n/an/an/an/an/an/a
Georgetown University
Curated by ChEMBL
Assay Description
Concentration required to inhibit autophosphorylation of cytoplasmic domain of epidermal growth factor receptor (EGFR)
Bioorg Med Chem Lett 14: 3397-400 (2004)
Article DOI: 10.1016/j.bmcl.2004.04.080
BindingDB Entry DOI: 10.7270/Q21Z4505
Receptor tyrosine-protein kinase erbB-2
(Homo sapiens (Human))
BDBM50122576
((E)-4-Morpholin-4-yl-but-2-enoic acid [4-(3-bromo-...)
Show SMILES COc1cc2ncc(C#N)c(Nc3cccc(Br)c3)c2cc1NC(=O)\C=C\CN1CCOCC1
Show InChI InChI=1S/C25H24BrN5O3/c1-33-23-14-21-20(13-22(23)30-24(32)6-3-7-31-8-10-34-11-9-31)25(17(15-27)16-28-21)29-19-5-2-4-18(26)12-19/h2-6,12-14,16H,7-11H2,1H3,(H,28,29)(H,30,32)/b6-3+
n/an/a 3.41E+4n/an/an/an/an/an/a
Wyeth Research
Curated by ChEMBL
Assay Description
Concentration required to inhibit autophosphorylation of cytoplasmic domain of human epidermal growth factor receptor-2
J Med Chem 46: 49-63 (2002)
Article DOI: 10.1021/jm020241c
BindingDB Entry DOI: 10.7270/Q2PV6M3H
Epidermal growth factor receptor
(Homo sapiens (Human))
BDBM50122576
((E)-4-Morpholin-4-yl-but-2-enoic acid [4-(3-bromo-...)
Show SMILES COc1cc2ncc(C#N)c(Nc3cccc(Br)c3)c2cc1NC(=O)\C=C\CN1CCOCC1
Show InChI InChI=1S/C25H24BrN5O3/c1-33-23-14-21-20(13-22(23)30-24(32)6-3-7-31-8-10-34-11-9-31)25(17(15-27)16-28-21)29-19-5-2-4-18(26)12-19/h2-6,12-14,16H,7-11H2,1H3,(H,28,29)(H,30,32)/b6-3+
n/an/a 3.83E+6n/an/an/an/an/an/a
TBA
Assay Description
Inhibition of EGFR (unknown origin)
Citation and Details
Article DOI: 10.1007/s00044-004-0105-8
BindingDB Entry DOI: 10.7270/Q2NZ8BJH
Epidermal growth factor receptor
(Homo sapiens (Human))
BDBM50122576
((E)-4-Morpholin-4-yl-but-2-enoic acid [4-(3-bromo-...)
Show SMILES COc1cc2ncc(C#N)c(Nc3cccc(Br)c3)c2cc1NC(=O)\C=C\CN1CCOCC1
Show InChI InChI=1S/C25H24BrN5O3/c1-33-23-14-21-20(13-22(23)30-24(32)6-3-7-31-8-10-34-11-9-31)25(17(15-27)16-28-21)29-19-5-2-4-18(26)12-19/h2-6,12-14,16H,7-11H2,1H3,(H,28,29)(H,30,32)/b6-3+
n/an/a 3.80E+3n/an/an/an/an/an/a
Korea Institute of Science and Technology
Curated by ChEMBL
Assay Description
Inhibition autophosphorylation of EGFR in human DiFi cells after 2 hrs by ELISA
Eur J Med Chem 43: 781-91 (2008)
Article DOI: 10.1016/j.ejmech.2007.06.006
BindingDB Entry DOI: 10.7270/Q2DJ5GXN
Epidermal growth factor receptor
(Homo sapiens (Human))
BDBM50122576
((E)-4-Morpholin-4-yl-but-2-enoic acid [4-(3-bromo-...)
Show SMILES COc1cc2ncc(C#N)c(Nc3cccc(Br)c3)c2cc1NC(=O)\C=C\CN1CCOCC1
Show InChI InChI=1S/C25H24BrN5O3/c1-33-23-14-21-20(13-22(23)30-24(32)6-3-7-31-8-10-34-11-9-31)25(17(15-27)16-28-21)29-19-5-2-4-18(26)12-19/h2-6,12-14,16H,7-11H2,1H3,(H,28,29)(H,30,32)/b6-3+
n/an/a 3.83E+3n/an/an/an/an/an/a
Wyeth Research
Curated by ChEMBL
Assay Description
Inhibition of autophosphorylation of cytoplasmic domain of epidermal growth factor receptor
J Med Chem 46: 49-63 (2002)
Article DOI: 10.1021/jm020241c
BindingDB Entry DOI: 10.7270/Q2PV6M3H