BDBM50122646 CHEMBL3623125
SMILES: [H][C@]12C(=O)N(C(=O)[C@@]1([H])[C@@]1(C)O[C@]2(C)C[C@H]1NS(=O)(=O)c1ccccc1F)c1ccc(C#N)c(c1)C(F)(F)F
InChI Key: InChIKey=DQMNGCGSWSTYKZ-LTFYTKAOSA-N
Data: 1 KI  1 IC50
Activity Spreadsheet -- Enzyme Inhibition Constant Data from BindingDB
Found 2 hits for monomerid = 50122646
Trg + Lig
Ki
nM
ΔG°
kcal/mole
IC50
nM
Kd
nM
EC50/IC50
nM
koff
s-1
kon
M-1s-1
pHTemp
°C
Androgen receptor
(Homo sapiens (Human))
BDBM50122646
(CHEMBL3623125)
Show SMILES [H][C@]12C(=O)N(C(=O)[C@@]1([H])[C@@]1(C)O[C@]2(C)C[C@H]1NS(=O)(=O)c1ccccc1F)c1ccc(C#N)c(c1)C(F)(F)F |r,TLB:16:15:1.7:11|
Show InChI InChI=1S/C24H19F4N3O5S/c1-22-10-17(30-37(34,35)16-6-4-3-5-15(16)25)23(2,36-22)19-18(22)20(32)31(21(19)33)13-8-7-12(11-29)14(9-13)24(26,27)28/h3-9,17-19,30H,10H2,1-2H3/t17-,18-,19+,22+,23+/m1/s1
NCI pathway
Reactome pathway
1n/an/an/an/an/an/an/an/a
Bristol Myers-Squibb Research and Development
Curated by ChEMBL
Assay Description
Displacement of [3H]-DHT from androgen receptor in human MDA-MB-453 cells after 90 mins by TopCount analysis
ACS Med Chem Lett 6: 908-12 (2015)
BindingDB Entry DOI: 10.7270/Q2QV3P96
Androgen receptor
(Homo sapiens (Human))
BDBM50122646
(CHEMBL3623125)
Show SMILES [H][C@]12C(=O)N(C(=O)[C@@]1([H])[C@@]1(C)O[C@]2(C)C[C@H]1NS(=O)(=O)c1ccccc1F)c1ccc(C#N)c(c1)C(F)(F)F |r,TLB:16:15:1.7:11|
Show InChI InChI=1S/C24H19F4N3O5S/c1-22-10-17(30-37(34,35)16-6-4-3-5-15(16)25)23(2,36-22)19-18(22)20(32)31(21(19)33)13-8-7-12(11-29)14(9-13)24(26,27)28/h3-9,17-19,30H,10H2,1-2H3/t17-,18-,19+,22+,23+/m1/s1
NCI pathway
Reactome pathway
n/an/a 10n/an/an/an/an/an/a
Bristol Myers-Squibb Research and Development
Curated by ChEMBL
Assay Description
Antagonist activity at androgen receptor in human MDA-MB-453 cells assessed as inhibition of DHT-induced PSA expression by alkaline phosphatase repor...
ACS Med Chem Lett 6: 908-12 (2015)
BindingDB Entry DOI: 10.7270/Q2QV3P96