BDBM50122653 6-(4-Amino-phenyl)-5-[(benzyl-methyl-amino)-methyl]-1-(2,6-difluoro-benzyl)-3-(3-methoxy-phenyl)-1H-thieno[2,3-d]pyrimidine-2,4-dione; HCL.H2O::CHEMBL280170
SMILES: COc1cccc(c1)-n1c(=O)n(Cc2c(F)cccc2F)c2sc(c(CN(C)Cc3ccccc3)c2c1=O)-c1ccc(N)cc1
InChI Key: InChIKey=JHYVSULGTMMINX-UHFFFAOYSA-N
Data: 1 IC50
Activity Spreadsheet -- Enzyme Inhibition Constant Data from BindingDB
Found 1 hit for monomerid = 50122653
Trg + Lig
Ki
nM
ΔG°
kcal/mole
IC50
nM
Kd
nM
EC50/IC50
nM
koff
s-1
kon
M-1s-1
pHTemp
°C
Gonadotropin-releasing hormone receptor
(Homo sapiens (Human))
BDBM50122653
(6-(4-Amino-phenyl)-5-[(benzyl-methyl-amino)-methyl...)
Show SMILES COc1cccc(c1)-n1c(=O)n(Cc2c(F)cccc2F)c2sc(c(CN(C)Cc3ccccc3)c2c1=O)-c1ccc(N)cc1
Show InChI InChI=1S/C35H30F2N4O3S/c1-39(19-22-8-4-3-5-9-22)20-28-31-33(42)41(25-10-6-11-26(18-25)44-2)35(43)40(21-27-29(36)12-7-13-30(27)37)34(31)45-32(28)23-14-16-24(38)17-15-23/h3-18H,19-21,38H2,1-2H3
n/an/a 1n/an/an/an/an/an/a
Takeda Chemical Industries, Ltd.
Curated by ChEMBL
Assay Description
Antagonist concentration required to inhibit specific binding of [125I]leuprorelin to human luteinizing releasing hormone receptor in cloned chinese ...
J Med Chem 46: 113-24 (2002)
Article DOI: 10.1021/jm020180i
BindingDB Entry DOI: 10.7270/Q26W9BTR