null
SMILES: Cc1ccccc1N1N=C(CCC1=O)c1c(nc2ccccn12)-c1ccc(F)cc1F
InChI Key: InChIKey=GDPTYJPHMSZXDA-UHFFFAOYSA-N
Activity Spreadsheet -- Enzyme Inhibition Constant Data from BindingDB
Found 4 hits for monomerid = 50122914
Trg + Lig
Ki
nM
ΔG°
kcal/mole
IC50
nM
Kd
nM
EC50/IC50
nM
koff
s-1
kon
M-1s-1
pHTemp
°C
Mitogen-activated protein kinase 11/12/13/14
(Homo sapiens (Human))
BDBM50122914
(6-(2-(2,4-difluorophenyl)imidazo[1,2-a]pyridin-3-y...)
Show SMILES Cc1ccccc1N1N=C(CCC1=O)c1c(nc2ccccn12)-c1ccc(F)cc1F |c:9|
Show InChI InChI=1S/C24H18F2N4O/c1-15-6-2-3-7-20(15)30-22(31)12-11-19(28-30)24-23(17-10-9-16(25)14-18(17)26)27-21-8-4-5-13-29(21)24/h2-10,13-14H,11-12H2,1H3
n/an/a 14n/an/an/an/an/an/a
Merck Research Laboratories
Curated by ChEMBL
Assay Description
Inhibition of Tumor necrosis factor alpha release from LPS-induced THP-1 cells by ELISA
J Med Chem 46: 349-52 (2003)
Article DOI: 10.1021/jm025585h
BindingDB Entry DOI: 10.7270/Q27P8XRR
Mitogen-activated protein kinase 14
(Mus musculus (mouse))
BDBM50122914
(6-(2-(2,4-difluorophenyl)imidazo[1,2-a]pyridin-3-y...)
Show SMILES Cc1ccccc1N1N=C(CCC1=O)c1c(nc2ccccn12)-c1ccc(F)cc1F |c:9|
Show InChI InChI=1S/C24H18F2N4O/c1-15-6-2-3-7-20(15)30-22(31)12-11-19(28-30)24-23(17-10-9-16(25)14-18(17)26)27-21-8-4-5-13-29(21)24/h2-10,13-14H,11-12H2,1H3
Reactome pathway
n/an/a 8n/an/an/an/an/an/a
Merck Research Laboratories
Curated by ChEMBL
Assay Description
Tested in vitro for filter plate binding versus gamma-[33P]ATP in active recombinant murine FLAG-P38 alpha fusion protein (GST-Activating transcripti...
J Med Chem 46: 349-52 (2003)
Article DOI: 10.1021/jm025585h
BindingDB Entry DOI: 10.7270/Q27P8XRR
Mitogen-activated protein kinase 11
(Mus musculus (mouse))
BDBM50122914
(6-(2-(2,4-difluorophenyl)imidazo[1,2-a]pyridin-3-y...)
Show SMILES Cc1ccccc1N1N=C(CCC1=O)c1c(nc2ccccn12)-c1ccc(F)cc1F |c:9|
Show InChI InChI=1S/C24H18F2N4O/c1-15-6-2-3-7-20(15)30-22(31)12-11-19(28-30)24-23(17-10-9-16(25)14-18(17)26)27-21-8-4-5-13-29(21)24/h2-10,13-14H,11-12H2,1H3
Reactome pathway
n/an/a 78n/an/an/an/an/an/a
Merck Research Laboratories
Curated by ChEMBL
Assay Description
Displacement of [gamma-33P]-ATP binding from active recombinant murine FLAG-Mitogen-activated protein kinase p38 beta fusion protein (GST-ATF2)
J Med Chem 46: 349-52 (2003)
Article DOI: 10.1021/jm025585h
BindingDB Entry DOI: 10.7270/Q27P8XRR
Mitogen-activated protein kinase 11/12/13/14
(Homo sapiens (Human))
BDBM50122914
(6-(2-(2,4-difluorophenyl)imidazo[1,2-a]pyridin-3-y...)
Show SMILES Cc1ccccc1N1N=C(CCC1=O)c1c(nc2ccccn12)-c1ccc(F)cc1F |c:9|
Show InChI InChI=1S/C24H18F2N4O/c1-15-6-2-3-7-20(15)30-22(31)12-11-19(28-30)24-23(17-10-9-16(25)14-18(17)26)27-21-8-4-5-13-29(21)24/h2-10,13-14H,11-12H2,1H3
n/an/a 440n/an/an/an/an/an/a
Merck Research Laboratories
Curated by ChEMBL
Assay Description
Inhibition of LPS-induced p38-related Tumor necrosis factor alpha release in human whole blood
J Med Chem 46: 349-52 (2003)
Article DOI: 10.1021/jm025585h
BindingDB Entry DOI: 10.7270/Q27P8XRR