BDBM50123095 6,7-Dihydroxy-2-[1-o-tolyl-meth-(E)-ylidene]-benzofuran-3-one::CHEMBL134046
SMILES: Cc1ccccc1\C=C1\Oc2c(ccc(O)c2O)C1=O
InChI Key: InChIKey=UIUOEAZOJXQSJZ-MDWZMJQESA-N
Data: 1 IC50
Activity Spreadsheet -- Enzyme Inhibition Constant Data from BindingDB
Found 1 hit for monomerid = 50123095
Trg + Lig
Ki
nM
ΔG°
kcal/mole
IC50
nM
Kd
nM
EC50/IC50
nM
koff
s-1
kon
M-1s-1
pHTemp
°C
Chorismate synthase
(Streptococcus pneumoniae)
BDBM50123095
(6,7-Dihydroxy-2-[1-o-tolyl-meth-(E)-ylidene]-benzo...)
Show SMILES Cc1ccccc1\C=C1\Oc2c(ccc(O)c2O)C1=O
Show InChI InChI=1S/C16H12O4/c1-9-4-2-3-5-10(9)8-13-14(18)11-6-7-12(17)15(19)16(11)20-13/h2-8,17,19H,1H3/b13-8+
n/an/a 4.00E+3n/an/an/an/an/an/a
PanTherix Ltd.
Curated by ChEMBL
Assay Description
Inhibitory concentration against Streptococcus pneumoniae chorismate synthase
Bioorg Med Chem Lett 13: 423-6 (2003)
BindingDB Entry DOI: 10.7270/Q2TH8M2M