BDBM50123097 2-[1-(4-Ethoxy-phenyl)-meth-(E)-ylidene]-6,7-dihydroxy-benzofuran-3-one::CHEMBL132700
SMILES: CCOc1ccc(\C=C2\Oc3c(ccc(O)c3O)C2=O)cc1
InChI Key: InChIKey=YRNDFACCFHUASX-NTEUORMPSA-N
Data: 1 IC50
Activity Spreadsheet -- Enzyme Inhibition Constant Data from BindingDB
Found 1 hit for monomerid = 50123097
Trg + Lig
Ki
nM
ΔG°
kcal/mole
IC50
nM
Kd
nM
EC50/IC50
nM
koff
s-1
kon
M-1s-1
pHTemp
°C
Chorismate synthase
(Streptococcus pneumoniae)
BDBM50123097
(2-[1-(4-Ethoxy-phenyl)-meth-(E)-ylidene]-6,7-dihyd...)
Show SMILES CCOc1ccc(\C=C2\Oc3c(ccc(O)c3O)C2=O)cc1
Show InChI InChI=1S/C17H14O5/c1-2-21-11-5-3-10(4-6-11)9-14-15(19)12-7-8-13(18)16(20)17(12)22-14/h3-9,18,20H,2H2,1H3/b14-9+
n/an/a 5.80E+3n/an/an/an/an/an/a
PanTherix Ltd.
Curated by ChEMBL
Assay Description
Inhibitory concentration against Streptococcus pneumoniae chorismate synthase
Bioorg Med Chem Lett 13: 423-6 (2003)
BindingDB Entry DOI: 10.7270/Q2TH8M2M