BDBM50123105 4-[6,7-Dihydroxy-3-oxo-3H-benzofuran-(2E)-ylidenemethyl]-benzoic acid::CHEMBL338732
SMILES: OC(=O)c1ccc(\C=C2\Oc3c(ccc(O)c3O)C2=O)cc1
InChI Key: InChIKey=KPSJJDXVCYMBFL-KPKJPENVSA-N
Data: 1 IC50
Activity Spreadsheet -- Enzyme Inhibition Constant Data from BindingDB
Found 1 hit for monomerid = 50123105
Trg + Lig
Ki
nM
ΔG°
kcal/mole
IC50
nM
Kd
nM
EC50/IC50
nM
koff
s-1
kon
M-1s-1
pHTemp
°C
Chorismate synthase
(Streptococcus pneumoniae)
BDBM50123105
(4-[6,7-Dihydroxy-3-oxo-3H-benzofuran-(2E)-ylidenem...)
Show SMILES OC(=O)c1ccc(\C=C2\Oc3c(ccc(O)c3O)C2=O)cc1
Show InChI InChI=1S/C16H10O6/c17-11-6-5-10-13(18)12(22-15(10)14(11)19)7-8-1-3-9(4-2-8)16(20)21/h1-7,17,19H,(H,20,21)/b12-7+
n/an/a 2.40E+4n/an/an/an/an/an/a
PanTherix Ltd.
Curated by ChEMBL
Assay Description
Inhibitory concentration against Streptococcus pneumoniae chorismate synthase
Bioorg Med Chem Lett 13: 423-6 (2003)
BindingDB Entry DOI: 10.7270/Q2TH8M2M