BDBM50123279 19-cyclopropylmethyl-6-(1H-1-pyrrolyl)-11-oxa-8,19-diazahexacyclo[10.9.1.01,10.02,18.04,9.016,22]docosa-4(9),5,7,12,14,16(22)-hexaene-2,13-diol::CHEMBL346165
SMILES: Oc1ccc2C[C@H]3N(CC4CC4)CC[C@@]45[C@@H](Oc1c24)c1ncc(cc1C[C@@]35O)-n1cccc1
InChI Key: InChIKey=AQPCHMHRVHPFAE-NVSKSXHLSA-N
Data: 6 KI
Activity Spreadsheet -- Enzyme Inhibition Constant Data from BindingDB
Found 6 hits for monomerid = 50123279
Trg + Lig
Ki
nM
ΔG°
kcal/mole
IC50
nM
Kd
nM
EC50/IC50
nM
koff
s-1
kon
M-1s-1
pHTemp
°C
Delta-type opioid receptor
(Homo sapiens (Human))
BDBM50123279
(19-cyclopropylmethyl-6-(1H-1-pyrrolyl)-11-oxa-8,19...)
Show SMILES Oc1ccc2C[C@H]3N(CC4CC4)CC[C@@]45[C@@H](Oc1c24)c1ncc(cc1C[C@@]35O)-n1cccc1
Show InChI InChI=1S/C27H27N3O3/c31-20-6-5-17-12-21-27(32)13-18-11-19(29-8-1-2-9-29)14-28-23(18)25-26(27,22(17)24(20)33-25)7-10-30(21)15-16-3-4-16/h1-2,5-6,8-9,11,14,16,21,25,31-32H,3-4,7,10,12-13,15H2/t21-,25+,26+,27-/m1/s1
Reactome pathway
0.400n/an/an/an/an/an/an/an/a
Southern Research Institute
Curated by ChEMBL
Assay Description
Antagonist activity on agonist stimulated [35S]GTP-gamma-S, binding in guinea pig caudate membranes (10 uM SNC-80 as the agonist ligand for delta-rec...
Bioorg Med Chem Lett 13: 529-32 (2003)
BindingDB Entry DOI: 10.7270/Q27S7P9P
Delta-type opioid receptor
(Rattus norvegicus (rat))
BDBM50123279
(19-cyclopropylmethyl-6-(1H-1-pyrrolyl)-11-oxa-8,19...)
Show SMILES Oc1ccc2C[C@H]3N(CC4CC4)CC[C@@]45[C@@H](Oc1c24)c1ncc(cc1C[C@@]35O)-n1cccc1
Show InChI InChI=1S/C27H27N3O3/c31-20-6-5-17-12-21-27(32)13-18-11-19(29-8-1-2-9-29)14-28-23(18)25-26(27,22(17)24(20)33-25)7-10-30(21)15-16-3-4-16/h1-2,5-6,8-9,11,14,16,21,25,31-32H,3-4,7,10,12-13,15H2/t21-,25+,26+,27-/m1/s1
Reactome pathway
0.640n/an/an/an/an/an/an/an/a
Southern Research Institute
Curated by ChEMBL
Assay Description
Binding affinity to delta opioid receptor was measured using [3H]DADLE
Bioorg Med Chem Lett 13: 529-32 (2003)
BindingDB Entry DOI: 10.7270/Q27S7P9P
Mu-type opioid receptor
(GUINEA PIG)
BDBM50123279
(19-cyclopropylmethyl-6-(1H-1-pyrrolyl)-11-oxa-8,19...)
Show SMILES Oc1ccc2C[C@H]3N(CC4CC4)CC[C@@]45[C@@H](Oc1c24)c1ncc(cc1C[C@@]35O)-n1cccc1
Show InChI InChI=1S/C27H27N3O3/c31-20-6-5-17-12-21-27(32)13-18-11-19(29-8-1-2-9-29)14-28-23(18)25-26(27,22(17)24(20)33-25)7-10-30(21)15-16-3-4-16/h1-2,5-6,8-9,11,14,16,21,25,31-32H,3-4,7,10,12-13,15H2/t21-,25+,26+,27-/m1/s1
4.20n/an/an/an/an/an/an/an/a
Southern Research Institute
Curated by ChEMBL
Assay Description
Antagonist activity on agonist stimulated [35S]GTP-gamma-S, binding in guinea pig caudate membranes (10 uM DAMGO as the agonist ligand for Mu-recepto...
Bioorg Med Chem Lett 13: 529-32 (2003)
BindingDB Entry DOI: 10.7270/Q27S7P9P
Kappa-type opioid receptor
(Cavia porcellus (domestic guinea pig))
BDBM50123279
(19-cyclopropylmethyl-6-(1H-1-pyrrolyl)-11-oxa-8,19...)
Show SMILES Oc1ccc2C[C@H]3N(CC4CC4)CC[C@@]45[C@@H](Oc1c24)c1ncc(cc1C[C@@]35O)-n1cccc1
Show InChI InChI=1S/C27H27N3O3/c31-20-6-5-17-12-21-27(32)13-18-11-19(29-8-1-2-9-29)14-28-23(18)25-26(27,22(17)24(20)33-25)7-10-30(21)15-16-3-4-16/h1-2,5-6,8-9,11,14,16,21,25,31-32H,3-4,7,10,12-13,15H2/t21-,25+,26+,27-/m1/s1
8.80n/an/an/an/an/an/an/an/a
Southern Research Institute
Curated by ChEMBL
Assay Description
Antagonist activity on agonist stimulated [35S]GTP-gamma-S, binding in guinea pig caudate membranes (10 uM U69,593 as the agonist ligand for kappa-re...
Bioorg Med Chem Lett 13: 529-32 (2003)
BindingDB Entry DOI: 10.7270/Q27S7P9P
Kappa-type opioid receptor
(Cavia porcellus (domestic guinea pig))
BDBM50123279
(19-cyclopropylmethyl-6-(1H-1-pyrrolyl)-11-oxa-8,19...)
Show SMILES Oc1ccc2C[C@H]3N(CC4CC4)CC[C@@]45[C@@H](Oc1c24)c1ncc(cc1C[C@@]35O)-n1cccc1
Show InChI InChI=1S/C27H27N3O3/c31-20-6-5-17-12-21-27(32)13-18-11-19(29-8-1-2-9-29)14-28-23(18)25-26(27,22(17)24(20)33-25)7-10-30(21)15-16-3-4-16/h1-2,5-6,8-9,11,14,16,21,25,31-32H,3-4,7,10,12-13,15H2/t21-,25+,26+,27-/m1/s1
12n/an/an/an/an/an/an/an/a
Southern Research Institute
Curated by ChEMBL
Assay Description
Binding affinity for kappa opioid receptor was measured using [3H]U-69593
Bioorg Med Chem Lett 13: 529-32 (2003)
BindingDB Entry DOI: 10.7270/Q27S7P9P
Mu-type opioid receptor
(Rattus norvegicus (rat))
BDBM50123279
(19-cyclopropylmethyl-6-(1H-1-pyrrolyl)-11-oxa-8,19...)
Show SMILES Oc1ccc2C[C@H]3N(CC4CC4)CC[C@@]45[C@@H](Oc1c24)c1ncc(cc1C[C@@]35O)-n1cccc1
Show InChI InChI=1S/C27H27N3O3/c31-20-6-5-17-12-21-27(32)13-18-11-19(29-8-1-2-9-29)14-28-23(18)25-26(27,22(17)24(20)33-25)7-10-30(21)15-16-3-4-16/h1-2,5-6,8-9,11,14,16,21,25,31-32H,3-4,7,10,12-13,15H2/t21-,25+,26+,27-/m1/s1
Reactome pathway
19n/an/an/an/an/an/an/an/a
Southern Research Institute
Curated by ChEMBL
Assay Description
Binding affinity to mu opioid receptor was measured using [3H]DAMGO
Bioorg Med Chem Lett 13: 529-32 (2003)
BindingDB Entry DOI: 10.7270/Q27S7P9P