BDBM50123309 6,8-Dimethoxy-2-phenethyl-3-thioxo-2,3-dihydro-imidazo[1,5-a]indol-1-one::CHEMBL149958
SMILES: COc1cc(OC)c2cc3C(=O)N(CCc4ccccc4)C(=S)n3c2c1
InChI Key: InChIKey=PLBAEZZILWKHLN-UHFFFAOYSA-N
Data: 1 IC50
Activity Spreadsheet -- Enzyme Inhibition Constant Data from BindingDB
Found 1 hit for monomerid = 50123309
Trg + Lig
Ki
nM
ΔG°
kcal/mole
IC50
nM
Kd
nM
EC50/IC50
nM
koff
s-1
kon
M-1s-1
pHTemp
°C
Tumor necrosis factor receptor R1
(Homo sapiens (Human))
BDBM50123309
(6,8-Dimethoxy-2-phenethyl-3-thioxo-2,3-dihydro-imi...)
Show SMILES COc1cc(OC)c2cc3C(=O)N(CCc4ccccc4)C(=S)n3c2c1
Show InChI InChI=1S/C20H18N2O3S/c1-24-14-10-16-15(18(11-14)25-2)12-17-19(23)21(20(26)22(16)17)9-8-13-6-4-3-5-7-13/h3-7,10-12H,8-9H2,1-2H3
NCI pathway
Reactome pathway
n/an/a 1.90E+3n/an/an/an/an/an/a
Bristol-Myers Squibb Pharmaceuticals
Curated by ChEMBL
Assay Description
Inhibition of TNF-alpha binding to TNFRc1
Bioorg Med Chem Lett 13: 533-8 (2003)
BindingDB Entry DOI: 10.7270/Q2X929N3