BDBM50123317 7-Methoxy-6-oxazol-5-yl-2-p-tolyl-1H-quinolin-4-one::CHEMBL152988
SMILES: COc1cc2nc(cc(O)c2cc1-c1cnco1)-c1ccc(C)cc1
InChI Key: InChIKey=NDACTGITQVDOGY-UHFFFAOYSA-N
Data: 2 IC50
Activity Spreadsheet -- Enzyme Inhibition Constant Data from BindingDB
Found 2 hits for monomerid = 50123317
Trg + Lig
Ki
nM
ΔG°
kcal/mole
IC50
nM
Kd
nM
EC50/IC50
nM
koff
s-1
kon
M-1s-1
pHTemp
°C
Inosine-5'-monophosphate dehydrogenase (IMPDH)
(Homo sapiens (Human))
BDBM50123317
(7-Methoxy-6-oxazol-5-yl-2-p-tolyl-1H-quinolin-4-on...)
Show SMILES COc1cc2nc(cc(O)c2cc1-c1cnco1)-c1ccc(C)cc1
Show InChI InChI=1S/C20H16N2O3/c1-12-3-5-13(6-4-12)16-8-18(23)14-7-15(20-10-21-11-25-20)19(24-2)9-17(14)22-16/h3-11H,1-2H3,(H,22,23)
Reactome pathway
n/an/a<5n/an/an/an/an/an/a
Bristol-Myers Squibb PRI
Curated by ChEMBL
Assay Description
Inhibition of human inosine monophosphate dehydrogenase IMPDH II
Bioorg Med Chem Lett 13: 543-6 (2003)
BindingDB Entry DOI: 10.7270/Q2SJ1JZT
Inosine Monophosphate Dehydrogenase Type 1 (IMPDH1)
(Homo sapiens (Human))
BDBM50123317
(7-Methoxy-6-oxazol-5-yl-2-p-tolyl-1H-quinolin-4-on...)
Show SMILES COc1cc2nc(cc(O)c2cc1-c1cnco1)-c1ccc(C)cc1
Show InChI InChI=1S/C20H16N2O3/c1-12-3-5-13(6-4-12)16-8-18(23)14-7-15(20-10-21-11-25-20)19(24-2)9-17(14)22-16/h3-11H,1-2H3,(H,22,23)
Reactome pathway
n/an/a 46n/an/an/an/an/an/a
Bristol-Myers Squibb PRI
Curated by ChEMBL
Assay Description
Inhibitory activity of the compound against inosine monophosphate dehydrogenase IMPDH type I
Bioorg Med Chem Lett 13: 543-6 (2003)
BindingDB Entry DOI: 10.7270/Q2SJ1JZT